{"text_format":"1","workbook":"xlsx","n_sheets":3,"sheets":["Form","Balance","Data"],"not_rendered":{"charts":0,"images":1,"macros":1,"external_links":0,"defined_names":98,"comments":0,"pivot_tables":0},"unopened":[],"bounds":{"document_bytes":16777216,"sheet_cells":100000,"rows_first":2000,"rows_last":500,"rows_between":2000,"halvings":0,"cell_chars":16384,"cell_head_chars":4096},"cells_cut":0,"cells_raw":0,"read":"whole","date_system":"1900"}

{"sheet":"Form","index":0,"n_rows":24,"n_cols":18,"rows_kept":24,"cut":false,"hidden":false,"merged":[[2,1,2,6],[2,9,2,12],[2,13,2,14],[3,9,3,12],[3,13,3,14],[3,1,3,7],[16,9,16,10],[17,9,17,10],[17,12,17,14],[15,12,16,15],[22,9,22,15],[20,9,20,10],[20,12,20,14],[21,9,21,15]]}
[null,{"$f":"IF(AND(TIGMODEL>\"\",TIG=\"\"),\"TIG with 4mm glass ONLY (Special order, contact CS)\",IF(AND(TIGMODEL>\"\",TIGBAL=1),\"TIG is NOT Available\",IF(TIG_NOTE>\"\",TIG_NOTE,\"\")))","v":""}]
[null,{"$f":"IF(AND(WSIZE>0,HSIZE>0),\"Only Available At\"&\"  \"&WSIZE&\" x \"&HSIZE&IF(HCONTROL=1,\" or \"&HSIZE2,\"\"),\"\")","v":""},null,null,null,null,null,"Select a Model"]
[null,{"$f":"IF(Model_Select=1,ModelNo,\"(Model\"&\" \"&ModelNo&\")\")","v":"Select a Model"},null,null,null,null,null,null,null,{"$f":"\"Min. W:\"&\" \"&MINW","v":"Min. W: 0"},null,null,null,{"$f":"\"Max W:\"&\" \"&MAXW","v":"Max W: 0"}]
[null,{"$f":"Description","v":0},null,null,null,null,null,null,null,{"$f":"\"Min. H:\"&\" \"&MINH","v":"Min. H: 0"},null,null,null,{"$f":"\"Max H:\"&\" \"&MAXH","v":"Max H: 0"},null,{"$f":"\"Max UI:\"&\" \"&MAXUI","v":"Max UI: 0"}]
[null,{"$f":"IF(AND(W>0,H>0),(IF(ISERROR(VLOOKUP(1,Data!$A:$D,3,FALSE)),\"\",VLOOKUP(1,Data!$A:$D,3,FALSE))),\"\")","v":""},null,null,null,null,null,{"$f":"IF(AND(W>0,H>0),(IF(ISERROR(VLOOKUP(1,Data!$A:$D,4,FALSE)),\"\",VLOOKUP(1,Data!$A:$D,4,FALSE))),\"\")","v":""},null,null,null,null,null,"Exact Size",null,null,null,{"$f":"IF(AND(W>0,H>0),\"DP:\"&\" \"&DP,\"\")","v":""}]
[null,{"$f":"IF(AND(W>0,H>0),(IF(ISERROR(VLOOKUP(2,Data!$A:$D,3,FALSE)),\"\",VLOOKUP(2,Data!$A:$D,3,FALSE))),\"\")","v":""},null,null,null,null,null,{"$f":"IF(AND(W>0,H>0),(IF(ISERROR(VLOOKUP(2,Data!$A:$D,4,FALSE)),\"\",VLOOKUP(2,Data!$A:$D,4,FALSE))),\"\")","v":""},null,"Width:",null,null,null,{"$f":"IF(AND(RO=2,W>0),W-WCUTBACK,W)","v":0},{"$f":"IF(AND(W>0,WSIZE>0,W<>WSIZE),\"<< Width Not Available\",\"\")","v":""}]
[null,{"$f":"IF(AND(W>0,H>0),(IF(ISERROR(VLOOKUP(3,Data!$A:$D,3,FALSE)),\"\",VLOOKUP(3,Data!$A:$D,3,FALSE))),\"\")","v":""},null,null,null,null,null,{"$f":"IF(AND(W>0,H>0),(IF(ISERROR(VLOOKUP(3,Data!$A:$D,4,FALSE)),\"\",VLOOKUP(3,Data!$A:$D,4,FALSE))),\"\")","v":""},null,"Height:",null,null,null,{"$f":"IF(AND(RO=2,H>0),H-HCUTBACK,H)","v":0},{"$f":"IF(AND(H>0,HSIZE>0,H<>HSIZE),\"<< Height Not Available\",\"\")","v":""}]
[null,{"$f":"IF(AND(W>0,H>0),(IF(ISERROR(VLOOKUP(4,Data!$A:$D,3,FALSE)),\"\",VLOOKUP(4,Data!$A:$D,3,FALSE))),\"\")","v":""},null,null,null,null,null,{"$f":"IF(AND(W>0,H>0),(IF(ISERROR(VLOOKUP(4,Data!$A:$D,4,FALSE)),\"\",VLOOKUP(4,Data!$A:$D,4,FALSE))),\"\")","v":""},null,{"$f":"IF(BTYPE=\"Custom\",\"CMR:\",\"\")","v":""},null,null,null,{"$f":"IF(AND(W>0,H>0,BTYPE=\"Custom\",CMR=0),\"<< Enter CMR Location\",\"\")","v":""}]
[null,{"$f":"IF(AND(W>0,H>0),(IF(ISERROR(VLOOKUP(5,Data!$A:$D,3,FALSE)),\"\",VLOOKUP(5,Data!$A:$D,3,FALSE))),\"\")","v":""},null,null,null,null,null,{"$f":"IF(AND(W>0,H>0),(IF(ISERROR(VLOOKUP(5,Data!$A:$D,4,FALSE)),\"\",VLOOKUP(5,Data!$A:$D,4,FALSE))),\"\")","v":""}]
[null,{"$f":"IF(AND(W>0,H>0),(IF(ISERROR(VLOOKUP(6,Data!$A:$D,3,FALSE)),\"\",VLOOKUP(6,Data!$A:$D,3,FALSE))),\"\")","v":""},null,null,null,null,null,{"$f":"IF(AND(W>0,H>0),(IF(ISERROR(VLOOKUP(6,Data!$A:$D,4,FALSE)),\"\",VLOOKUP(6,Data!$A:$D,4,FALSE))),\"\")","v":""},null,{"$f":"IF(ModelNo=\"3001\",\"Reinf:\",\"\")","v":""},null,null,null,{"$f":"IF(AND(W>0,H>0,REINFSELECT=1,ModelNo=\"3001\"),\"<< Must Select\",\"\")","v":""}]
[null,{"$f":"IF(AND(W>0,H>0),(IF(ISERROR(VLOOKUP(7,Data!$A:$D,3,FALSE)),\"\",VLOOKUP(7,Data!$A:$D,3,FALSE))),\"\")","v":""},null,null,null,null,null,{"$f":"IF(AND(W>0,H>0),(IF(ISERROR(VLOOKUP(7,Data!$A:$D,4,FALSE)),\"\",VLOOKUP(7,Data!$A:$D,4,FALSE))),\"\")","v":""},null,"Opening:",null,null,null,{"$f":"RO_OPTION","v":0}]
[null,{"$f":"IF(AND(W>0,H>0),(IF(ISERROR(VLOOKUP(8,Data!$A:$D,3,FALSE)),\"\",VLOOKUP(8,Data!$A:$D,3,FALSE))),\"\")","v":""},null,null,null,null,null,{"$f":"IF(AND(W>0,H>0),(IF(ISERROR(VLOOKUP(8,Data!$A:$D,4,FALSE)),\"\",VLOOKUP(8,Data!$A:$D,4,FALSE))),\"\")","v":""},null,"Type:"]
[null,{"$f":"IF(AND(W>0,H>0),(IF(ISERROR(VLOOKUP(9,Data!$A:$D,3,FALSE)),\"\",VLOOKUP(9,Data!$A:$D,3,FALSE))),\"\")","v":""},null,null,null,null,null,{"$f":"IF(AND(W>0,H>0),(IF(ISERROR(VLOOKUP(9,Data!$A:$D,4,FALSE)),\"\",VLOOKUP(9,Data!$A:$D,4,FALSE))),\"\")","v":""},null,"Screen:"]
[null,{"$f":"IF(AND(W>0,H>0),(IF(ISERROR(VLOOKUP(10,Data!$A:$D,3,FALSE)),\"\",VLOOKUP(10,Data!$A:$D,3,FALSE))),\"\")","v":""},null,null,null,null,null,{"$f":"IF(AND(W>0,H>0),(IF(ISERROR(VLOOKUP(10,Data!$A:$D,4,FALSE)),\"\",VLOOKUP(10,Data!$A:$D,4,FALSE))),\"\")","v":""},null,"Glass:",null,null,null,null,{"$f":"GLASS_MESSAGE","v":0}]
[]
{"$rows_left_out":10}
{"sheet":"Balance","index":1,"n_rows":271,"n_cols":34,"rows_kept":271,"cut":false,"hidden":true,"merged":[[25,9,25,10],[9,9,9,10],[1,5,1,12],[1,15,1,16],[0,27,0,31],[1,25,1,28],[1,30,1,33]]}
[null,null,null,null,null,null,null,null,null,null,null,null,null,null,null,null,null,null,null,null,null,null,null,null,null,null,null,"BLOCK & TACKLE BALANCE CHART"]
[null,null,null,"Glass Strength",null,"Weight Calculation",null,null,null,null,null,null,null,null,null,"Egress Calculation",null,null,null,null,null,null,null,null,null,"TOP SASH",null,null,null,null,"BOTTOM SASH"]
[1,"S",{"$f":"1.157*2","v":2.3140000000000001},"Single Strength (2.5 mm)",null,"Model","CDIM","Bott. Sash Height","Bottom Sash Weight","Top Sash Weight","Bal. Loc.",null,null,"EW",null,"Top Sash Height",{"$f":"IF(J18>J19,J18-2.0625,0)","v":0},null,null,"9001","Length","Weight/ft","Weight",null,null,"Sash Weight","Tube Length","Balance","Weight",null,"Sash Weight","Tube Length","Balance","Weight"]
[2,"D",{"$f":"1.6*2","v":3.2},"Double Strength (3 mm)",null,{"$f":"ModelNo","v":"Select a Model"},{"$f":"VLOOKUP(ModelNo,$F$5:$N$7,2,FALSE)","v":{"$error":"#N/A"}},{"$f":"VLOOKUP(ModelNo,$F$5:$N$7,3,FALSE)","v":{"$error":"#N/A"}},{"$f":"VLOOKUP(ModelNo,$F$5:$N$7,4,FALSE)","v":{"$error":"#N/A"}},{"$f":"VLOOKUP(ModelNo,$F$5:$N$7,5,FALSE)","v":{"$error":"#N/A"}},{"$f":"VLOOKUP(ModelNo,$F$5:$N$7,6,FALSE)","v":{"$error":"#N/A"}},{"$f":"VLOOKUP(ModelNo,$F$5:$N$7,7,FALSE)","v":{"$error":"#N/A"}},{"$f":"VLOOKUP(ModelNo,$F$5:$N$7,8,FALSE)","v":{"$error":"#N/A"}},{"$f":"VLOOKUP(ModelNo,$F$5:$N$7,9,FALSE)","v":{"$error":"#N/A"}},null,"Egress Height",{"$f":"IF($Q$3=0,Frame_Height-H4-7.5,IF($Q$3>0,Frame_Height-$Q$3-7.5,0))","v":{"$error":"#N/A"}},null,null,"Top Top Rail",{"$f":"(Frame_Width-4.875)/12","v":-0.40625},0.34100000000000003,{"$f":"U4*V4","v":-0.13853125000000002},null,null,{"$f":"TRUNC(TOP_WGT)","v":{"$error":"#N/A"}},{"$f":"$Z$9","v":{"$error":"#N/A"}},"Number","Range",null,{"$f":"TRUNC(BTM_WGT)","v":{"$error":"#N/A"}},{"$f":"$AE$9","v":-4},"Number","Range"]
[3,"T",{"$f":"2.408*2","v":4.8159999999999998},"Triple Strength (5 mm)",null,"P601",{"$f":"Balance!$J$19","v":0},{"$f":"INT((Balance!$J$19-1.19)*32)/32","v":-1.21875},{"$f":"$W$25","v":0},{"$f":"$W$24","v":0},null,null,null,5.9375,null,"Egress Width",{"$f":"Frame_Width-N4","v":{"$error":"#N/A"}},null,null,"Top Bottom Rail",{"$f":"(Frame_Width-4.875)/12","v":-0.40625},0.38400000000000001,-0.156,null,null,"Balance Size",{"$f":"IF(AND(AB5>0,AC5>0),AB5,0)","v":{"$error":"#N/A"}},{"$f":"IF($AA$4<=6,6,0)","v":{"$error":"#N/A"}},{"$f":"IF(AND(AB5=6,$Z$4>=2,$Z$4<=5),AB5&\"A\",0)","v":{"$error":"#N/A"}},null,"Balance Size",{"$f":"IF(AND(AG5>0,AH5>0),AG5,0)","v":{"$error":"#N/A"}},{"$f":"IF($AF$4<=6,6,0)","v":6},{"$f":"IF(AND(AG5=6,$AE$4>=2,$AE$4<=5),AG5&\"A\",0)","v":{"$error":"#N/A"}}]
[4,"L",{"$f":"2.683*2","v":5.3659999999999997},"Laminated",null,"9001",{"$f":"Balance!$J$19","v":0},{"$f":"INT((Balance!$J$19-1.19)*32)/32","v":-1.21875},{"$f":"$W$25","v":0},{"$f":"$W$24","v":0},null,null,null,5.9375,null,"Egress Area",{"$f":"ROUND(((EH*EW)/144),3)","v":{"$error":"#N/A"}},null,null,"Top Stile",{"$f":"(2*(Balance!$J$18-2.19))/12","v":-0.36499999999999999},0.311,-0.11351499999999999,null,null,{"$f":"VLOOKUP((MAX(AA5:AA271)),AA5:AC271,3,FALSE)","v":{"$error":"#N/A"}},{"$error":"#N/A"},{"$error":"#N/A"},{"$f":"IF(AND(AB6=6,$Z$4>=6,$Z$4<=9),AB6&\"B\",0)","v":{"$error":"#N/A"}},null,{"$f":"VLOOKUP((MAX(AF5:AF271)),AF5:AH271,3,FALSE)","v":{"$error":"#N/A"}},{"$error":"#N/A"},6,{"$f":"IF(AND(AG6=6,$AE$4>=6,$AE$4<=9),AG6&\"B\",0)","v":{"$error":"#N/A"}}]
[5,"STG",{"$f":"1.157*3","v":3.4710000000000001},"Triple IG Single Strength",null,"3001",{"$f":"CDIM3001","v":0},{"$f":"CDIM3001-0.625","v":-0.625},{"$f":"BSW_3001","v":0},{"$f":"TSW_3001","v":0},null,null,null,5.25,null,null,null,null,null,"Keeper Rail Reinf.",{"$f":"IF((INT((Frame_Width-9.875)/2)*2)>6,(INT((Frame_Width-9.875)/2)*2)/12,0)","v":0},3.9E-2,0,null,null,null,{"$error":"#N/A"},{"$error":"#N/A"},{"$f":"IF(AND(AB7=6,$Z$4>=10,$Z$4<=12),AB7&\"C\",0)","v":{"$error":"#N/A"}},null,null,{"$error":"#N/A"},6,{"$f":"IF(AND(AG7=6,$AE$4>=10,$AE$4<=12),AG7&\"C\",0)","v":{"$error":"#N/A"}}]
[6,"TDG",{"$f":"1.6*3","v":4.8000000000000007},"Triple IG Double Strength",null,null,null,null,null,null,null,null,null,null,null,null,null,null,null,"Keeper Bead",{"$f":"(Frame_Width-6.072)/12","v":-0.50600000000000001},9.7000000000000003E-2,-4.9082000000000001E-2,null,null,"Top Tube length",{"$error":"#N/A"},{"$error":"#N/A"},{"$f":"IF(AND(AB8=6,$Z$4>=13,$Z$4<=15),AB8&\"D\",0)","v":{"$error":"#N/A"}},null,"Bott. Tube Length",{"$error":"#N/A"},6,{"$f":"IF(AND(AG8=6,$AE$4>=13,$AE$4<=15),AG8&\"D\",0)","v":{"$error":"#N/A"}}]
[null,null,null,2,null,null,null,null,null,null,null,null,null,null,null,null,null,null,null,"Top Glass",{"$f":"(Balance!$J$21*Balance!$J$23)/144","v":0.18517388237847221},{"$f":"$C$10","v":3.2},0.59255642361111105,null,{"$f":"ModelNo","v":"Select a Model"},{"$f":"VLOOKUP(Y9,Y10:Z12,2,FALSE)","v":{"$error":"#N/A"}},{"$error":"#N/A"},{"$error":"#N/A"},{"$f":"IF(AND(AB9=6,$Z$4>=16,$Z$4<=20),AB9&\"E\",0)","v":{"$error":"#N/A"}},{"$f":"ModelNo","v":"Select a Model"},{"$f":"(INT(INT((Frame_Height/2-2.75)+0.25)/2)*2)","v":-4},{"$error":"#N/A"},6,{"$f":"IF(AND(AG9=6,$AE$4>=16,$AE$4<=20),AG9&\"E\",0)","v":{"$error":"#N/A"}}]
[null,null,{"$f":"VLOOKUP(Glass,A3:C8,3,FALSE)","v":3.2},{"$f":"VLOOKUP(Glass,A3:C8,2,FALSE)","v":"D"},null,null,null,"W",null,"9001",null,null,null,null,null,null,null,null,null,"Top Spacer",{"$f":"((Balance!$J$21*2)+(Balance!$J$23*2))/12","v":-1.78125},5.3600000000000002E-2,-9.5475000000000004E-2,null,"9001",{"$f":"IF(J18>=Frame_Height/2-0.07,(INT(INT((Frame_Height/2-4.75)+0.25)/2))*2,(INT(INT((J18-4.75)+0.25)/2))*2)","v":-6},{"$error":"#N/A"},{"$error":"#N/A"},{"$f":"IF(AND(AB10=6,$Z$4>=21,$Z$4<=24,ModelNo=\"9001\"),\"Dbl.\"&AB10&\"C\",0)","v":{"$error":"#N/A"}},"9001",{"$f":"(INT(INT((Frame_Height/2-2.75)+0.25)/2)*2)","v":-4},{"$error":"#N/A"},6,{"$f":"IF(AND(AG10=6,$AE$4>=21,$AE$4<=24,ModelNo=\"9001\"),\"Dbl.\"&AG10&\"C\",0)","v":{"$error":"#N/A"}}]
[null,null,null,null,null,null,null,{"$f":"IF(TYPE=1,H10,IF(TYPE= \"\",H10,\" \"))","v":"W"},1,{"$f":"Frame_Height/2","v":0},{"$f":"TRUNC(J11*16+0.5)/16","v":0},null,null,null,null,null,null,null,null,"Top Hardware",1,0.2,0.2,null,"3001",{"$f":"IF(DDIM3001>=(Frame_Height/2),FLOOR((Frame_Height/2)-4.75,2),FLOOR(DDIM3001-4.75,2))","v":-6},{"$error":"#N/A"},{"$error":"#N/A"},{"$f":"IF(AND(AB11=6,$Z$4>=25,$Z$4<=30,ModelNo=\"9001\"),\"Dbl.\"&AB11&\"D\",0)","v":{"$error":"#N/A"}},"3001",{"$f":"FLOOR(Frame_Height/2-2.25,2)","v":-4},{"$error":"#N/A"},6,{"$f":"IF(AND(AG11=6,$AE$4>=25,$AE$4<=30,ModelNo=\"9001\"),\"Dbl.\"&AG11&\"D\",0)","v":{"$error":"#N/A"}}]
[null,null,null,"Type",null,null,null,{"$f":"IF(TYPE=5,H10,IF(TYPE=2,IF(Frame_Height>=54.5,IF(Frame_Height<72.5,H10,\"\"),\"\"),\"\"))","v":""},2,{"$f":"CEILING(((Frame_Height/5-0.24)*3-0.03125),0.0625)","v":-0.75},-0.6875,5,null,null,null,null,null,null,null,"Top Handle Bead",{"$f":"(Frame_Width-6.072)/12","v":-0.50600000000000001},9.7000000000000003E-2,-4.9082000000000001E-2,null,"P601",{"$f":"IF(J18>=Frame_Height/2-0.07,(INT(INT((Frame_Height/2-4.75)+0.25)/2))*2,(INT(INT((J18-4.75)+0.25)/2))*2)","v":-6},{"$error":"#N/A"},{"$error":"#N/A"},{"$f":"IF(AND(AB12=6,$Z$4>=31,$Z$4<=40,ModelNo=\"9001\"),\"Dbl.\"&AB12&\"E\",0)","v":{"$error":"#N/A"}},null,null,{"$error":"#N/A"},6,{"$f":"IF(AND(AG12=6,$AE$4>=31,$AE$4<=40,ModelNo=\"9001\"),\"Dbl.\"&AG12&\"E\",0)","v":{"$error":"#N/A"}}]
[null,null,1,{"$f":"IF(TYPE1>\"\",TYPE1,\"\")","v":""},null,null,null,{"$f":"IF(TYPE=6,H10,IF(AND(TYPE=2,OR(Frame_Height<54.5,Frame_Height>=72.5)),H10,\"\"))","v":""},null,{"$f":"TRUNC((Frame_Height/3-0.62)*32+0.5)/16","v":-1.1875},-1.125,6,null,null,null,null,null,null,null,"Top Vertical Beads",{"$f":"((Balance!$J$18-3.387)*2)/12","v":-0.5645},9.7000000000000003E-2,-5.47565E-2,null,null,null,{"$error":"#N/A"},{"$f":"IF(AND($AA$4<=8,$AA$4>6),8,0)","v":{"$error":"#N/A"}},{"$f":"IF(AND(AB13=8,$Z$4>=2,$Z$4<=6),AB13&\"A\",0)","v":{"$error":"#N/A"}},null,null,{"$error":"#N/A"},{"$f":"IF(AND($AF$4<=8,$AF$4>6),8,0)","v":0},{"$f":"IF(AND(AG13=8,$AE$4>=2,$AE$4<=6),AG13&\"A\",0)","v":{"$error":"#N/A"}}]
[null,null,2,{"$f":"IF(TYPE2>\"\",TYPE2,\"\")","v":""},null,null,null,{"$f":"IF(TYPE=7,H10,IF(TYPE=3,IF(Frame_Height>=54.5,IF(Frame_Height<72.5,H10,\"\"),\"\"),\"\"))","v":""},3,{"$f":"TRUNC((Frame_Height/5+0.38)*32+0.5)/16","v":0.75},0.75,7,null,null,null,null,null,null,null,"Bottom Top Rail",{"$f":"(Frame_Width-3.875)/12","v":-0.32291666666666669},0.42799999999999999,-0.13820833333333335,null,null,null,{"$error":"#N/A"},{"$error":"#N/A"},{"$f":"IF(AND(AB14=8,$Z$4>=7,$Z$4<=10),AB14&\"B\",0)","v":{"$error":"#N/A"}},null,null,{"$error":"#N/A"},0,{"$f":"IF(AND(AG14=8,$AE$4>=7,$AE$4<=10),AG14&\"B\",0)","v":{"$error":"#N/A"}}]
[null,null,3,{"$f":"IF(TYPE3>\"\",TYPE3,\"\")","v":""},null,null,null,{"$f":"IF(TYPE=8,H10,IF(AND(TYPE=3,OR(Frame_Height<54.5,Frame_Height>=72.5)),H10,\"\"))","v":""},null,{"$f":"TRUNC((Frame_Height/3+1.3)*16+0.5)/16","v":1.3125},1.3125,8,null,null,null,null,null,null,null,"Bottom Bottom Rail",{"$f":"(Frame_Width-3.875)/12","v":-0.32291666666666669},0.443,-0.14305208333333333,null,null,null,{"$error":"#N/A"},{"$error":"#N/A"},{"$f":"IF(AND(AB15=8,$Z$4>=11,$Z$4<=13),AB15&\"C\",0)","v":{"$error":"#N/A"}},null,null,{"$error":"#N/A"},0,{"$f":"IF(AND(AG15=8,$AE$4>=11,$AE$4<=13),AG15&\"C\",0)","v":{"$error":"#N/A"}}]
{"$rows_left_out":257}
{"sheet":"Data","index":2,"n_rows":405,"n_cols":43,"rows_kept":405,"cut":false,"hidden":true,"merged":[]}
[null,"Model","Description","Value"]
[{"$f":"IF(ModelNo=B2,1,\"\")","v":""},"9051","Sash Width",{"$f":"Frame_Width-1.625","v":-1.625},null,{"$f":"G62","v":"Select a Model"},"Models","Description","W cut-back","H-cut-back","Width","Height","Min W","Min H","Max W","Max H","Max UI","Type1","Type2","Type3","Type4","Screen1","Screen2","Screen3","Glass Thickness","Glass","Opening",null,null,null,null,null,null,null,null,null,null,null,"Triple IG calculation"]
[{"$f":"IF(ModelNo=B3,2,\"\")","v":""},"9051","Sash Height",{"$f":"Frame_Height-1.625","v":-1.625},null,1,"Select a Model"]
[{"$f":"IF(ModelNo=B4,3,\"\")","v":""},"9051","Sash Glass Width",{"$f":"Frame_Width-4.625","v":-4.625},null,2,"3001","Reserve Double Hung",0,0,null,null,12,20,{"$f":"IF(REINFSELECT=2,48,IF(REINFSELECT=3,52,\"\"))","v":""},{"$f":"IF(REINFSELECT=2,84,IF(REINFSELECT=3,96,\"\"))","v":""},{"$f":"IF(REINFSELECT=2,126,IF(REINFSELECT=3,148,\"\"))","v":""},"Standard","Oriel (2/3 - 1/3)","Cottage (1/3 - 2/3)","Custom","Half","Full","Locking",5,null,{"$f":"IF(RO=2,\"<< Exact Size Only\",\"\")","v":""},null,null,null,null,null,null,null,null,null,null,null,"SS (2.2)","DS (3.2)","4 mm","TS (5.0)"]
[{"$f":"IF(ModelNo=B5,4,\"\")","v":""},"9051","Sash Glass Height",{"$f":"Frame_Height-4.625","v":-4.625},null,3,"3002","Reserve Two Lite Slider",0,0,null,null,18.5,11.25,{"$f":"IF(REINFSELECT=2,72,IF(REINFSELECT=3,84,\"\"))","v":""},{"$f":"IF(REINFSELECT=2,56,IF(REINFSELECT=3,72,\"\"))","v":""},{"$f":"IF(REINFSELECT=2,128,IF(REINFSELECT=3,156,\"\"))","v":""},"Standard",null,null,null,"Half","Full",null,5,null,{"$f":"IF(RO=2,\"<< Exact Size Only\",\"\")","v":""},null,null,null,null,1,"Single Strength (2.5 mm)",null,null,null,null,"Max. Short",{"$f":"IF(TG2W>41,0,41)","v":0},{"$f":"IF(TG2W>56,0,56)","v":0},{"$f":"IF(TG2W>67,0,67)","v":0},{"$f":"IF(TG2W>70,0,70)","v":0},"Annealed"]
[{"$f":"IF(ModelNo=B6,5,\"\")","v":""},"9051","Glass Area (sq.ft.)",{"$f":"(D4*D5)/144","v":0.14854600694444445},null,4,"3003","Reserve Three Lite Slider (1/4-1/2-1/4)",0,0,null,null,47.5,11.25,{"$f":"IF(REINFSELECT=2,108,IF(REINFSELECT=3,120,\"\"))","v":""},{"$f":"IF(REINFSELECT=2,56,IF(REINFSELECT=3,72,\"\"))","v":""},{"$f":"IF(REINFSELECT=2,164,IF(REINFSELECT=3,192,\"\"))","v":""},"Standard (1/4-1/2-1/4)",null,null,null,"Half","Full",null,5,null,{"$f":"IF(RO=2,\"<< Exact Size Only\",\"\")","v":""},null,null,null,null,2,"Double Strength (3 mm)",null,null,null,null,"Max. Long",{"$f":"IF(TG2H>62,0,62)","v":0},{"$f":"IF(TG2H>76,0,76)","v":0},{"$f":"IF(TG2H>90,0,90)","v":0},{"$f":"IF(TG2H>102,0,102)","v":0},"Annealed"]
[{"$f":"IF(ModelNo=B7,6,\"\")","v":""},"9051","Screen Width",{"$f":"Frame_Width-4","v":-4},null,5,"3004","Reserve Picture Window",0,0,null,null,9.5,9.5,112,96,154,"Standard",null,null,null,null,null,null,5,null,{"$f":"IF(RO=2,\"<< Exact Size Only\",\"\")","v":""},null,null,null,null,3,"Triple Strength (5 mm)",null,null,null,null,"Max Sq.Ft.",{"$f":"IF(TG2A>12,0,12)","v":0},{"$f":"IF(TG2A>22,0,22)","v":0},{"$f":"IF(TG2A>32,0,32)","v":0},{"$f":"IF(TG2A>35,0,35)","v":0},"Annealed"]
[{"$f":"IF(ModelNo=B8,7,\"\")","v":""},"9051","Screen Height",{"$f":"Frame_Height-4","v":-4},null,6,"3009","Reserve Three Lite Slider Equal Lite",0,0,null,null,37.25,11.25,{"$f":"IF(REINFSELECT=2,108,IF(REINFSELECT=3,120,\"\"))","v":""},{"$f":"IF(REINFSELECT=2,56,IF(REINFSELECT=3,72,\"\"))","v":""},{"$f":"IF(REINFSELECT=2,164,IF(REINFSELECT=3,192,\"\"))","v":""},"Standard (1/3-1/3-1/3)",null,null,null,"Half","Full",null,5,null,{"$f":"IF(RO=2,\"<< Exact Size Only\",\"\")","v":""},null,null,null,null,4,"Laminated",null,null,null,null,"Max. Short",0,{"$f":"IF(TG2W>42,0,42)","v":0},{"$f":"IF(TG2W>70,0,70)","v":0},{"$f":"IF(TG2W>70,0,70)","v":0},"Tempered"]
[{"$f":"IF(ModelNo=B9,8,\"\")","v":""},"9051","Awning Does not Meet Egress",null,null,7,"9001","Preservation Double Hung",0,0,null,null,16,26,52,84,136,"Standard","Oriel (2/3 - 1/3)","Cottage (1/3 - 2/3)","Custom","Half","Full","Locking",5,null,{"$f":"IF(RO=2,\"<< Exact Size Only\",\"\")","v":""},null,null,null,null,5,"Triple IG Single Strength",null,null,null,null,"Max. Long",0,{"$f":"IF(TG2H>84,0,84)","v":0},{"$f":"IF(TG2H>129,0,129)","v":0},{"$f":"IF(TG2H>129,0,129)","v":0},"Tempered"]
[{"$f":"IF(ModelNo=B10,1,\"\")","v":""},"9052","Operating Sash Width",{"$f":"Frame_Width-1.625","v":-1.625},null,8,"9002","Preservation Two Lite Slider",0,0,null,null,25.25,16.625,84,68,148,"Standard",null,null,null,"Half","Full",null,5,null,"",null,null,null,null,6,"Triple IG Double Strength",null,null,null,null,"Max Sq.Ft.",0,{"$f":"IF(TG2A>24.5,0,24.5)","v":0},{"$f":"IF(TG2A>42,0,42)","v":0},{"$f":"IF(TG2A>42,0,42)","v":0},"Tempered"]
[{"$f":"IF(ModelNo=B11,2,\"\")","v":""},"9052","Operating Sash Height",{"$f":"(Frame_Height/2)-1.375","v":-1.375},null,9,"9003","Preservation Three Lite Slider (1/4-1/2-1/4)",0,0,null,null,44.5,16.625,120,68,184,"Standard (1/4-1/2-1/4)",null,null,null,"Half","Full",null,5,null,"",null,null,null,null,null,null,null,null,null,null,null,{"$f":"IF(AND(AM5>0,AM6>0,AM7>0),1,0)","v":0},{"$f":"IF(AND(AN5>0,AN6>0,AN7>0),1,0)","v":0},{"$f":"IF(AND(AO5>0,AO6>0,AO7>0),1,0)","v":0},{"$f":"IF(AND(AP5>0,AP6>0,AP7>0),1,0)","v":0},{"$f":"IF(AM11>0,\"≥SS Annealed\",IF(AN11>0,\"≥DS Annealed\",IF(AP11>0,\"TS Annealed\",\"\")))","v":""}]
[{"$f":"IF(ModelNo=B12,3,\"\")","v":""},"9052","Fixed Sash Width",{"$f":"Frame_Width-1.625","v":-1.625},null,10,"9009","Preservation Three Lite Slider Equal Lite",0,0,null,null,35.5,16.625,120,68,184,"Standard (1/3-1/3-1/3)",null,null,null,"Half","Full",null,5,null,"",null,null,null,null,null,null,null,null,null,null,null,null,{"$f":"IF(AND(AN8>0,AN9>0,AN10>0),1,0)","v":0},{"$f":"IF(AND(AO8>0,AO9>0,AO10>0),1,0)","v":0},{"$f":"IF(AND(AP8>0,AP9>0,AP10>0),1,0)","v":0},{"$f":"IF(AN12>0,\"≥DS Tempered\",IF(AP12>0,\"TS Tempered\",\"\"))","v":""}]
[{"$f":"IF(ModelNo=B13,4,\"\")","v":""},"9052","Fixed Sash Height",{"$f":"(Frame_Height/2)-1.375","v":-1.375},null,11,"9014","Preservation Picture Window",0,0,null,null,13,13,96,84,154,"Standard",null,null,null,null,null,null,5,null,"",null,null,null,null,null,null,null,null,null,null,null,"2.5 mm","3.2 mm","4 mm","5 mm"]
[{"$f":"IF(ModelNo=B14,5,\"\")","v":""},"9052","Operating Sash Glass Width",{"$f":"Frame_Width-4.625","v":-4.625},null,12,"9022","Preservation Two Lite Swign & Clean",0,0,null,null,30,20,72,60,120,"Standard",null,null,null,"Half","Full",null,5,null,"",null,null,null,null,null,null,null,null,null,null,"Max. Short",{"$f":"IF(TG2H>41,0,41)","v":0},{"$f":"IF(TG2H>56,0,56)","v":0},{"$f":"IF(TG2H>67,0,67)","v":0},{"$f":"IF(TG2H>70,0,70)","v":0},"Annealed"]
[{"$f":"IF(ModelNo=B15,6,\"\")","v":""},"9052","Operating Sash Glass Height",{"$f":"Frame_Height/2-4.375","v":-4.375},null,13,"9023","Preservation Three Lite Swign & Clean (1/4-1/2-1/4)",0,0,null,null,48,20,84,60,144,"Standard (1/4-1/2-1/4)",null,null,null,"Half","Full",null,5,null,"",null,null,null,null,null,null,null,null,null,null,"Max. Long",{"$f":"IF(TG2W>62,0,62)","v":0},{"$f":"IF(TG2W>76,0,76)","v":0},{"$f":"IF(TG2W>90,0,90)","v":0},{"$f":"IF(TG2W>102,0,102)","v":0},"Annealed"]
{"$rows_left_out":390}