{"text_format":"1","workbook":"xlsx","n_sheets":3,"sheets":["Form","Balance","Data"],"not_rendered":{"charts":0,"images":1,"macros":1,"external_links":0,"defined_names":98,"comments":0,"pivot_tables":0},"unopened":[],"bounds":{"document_bytes":16777216,"sheet_cells":100000,"rows_first":2000,"rows_last":500,"rows_between":2000,"halvings":0,"cell_chars":16384,"cell_head_chars":4096},"cells_cut":0,"cells_raw":0,"read":"whole","date_system":"1900"}

{"sheet":"Form","index":0,"n_rows":24,"n_cols":18,"rows_kept":24,"cut":false,"hidden":false,"merged":[[2,1,2,6],[2,9,2,12],[2,13,2,14],[3,9,3,12],[3,13,3,14],[3,1,3,7],[16,9,16,10],[17,9,17,10],[17,12,17,14],[15,12,16,15],[22,9,22,15],[20,9,20,10],[20,12,20,14],[21,9,21,15]]}
[null,{"$f":"IF(AND(TIGMODEL>\"\",TIG=\"\"),\"TIG with 4mm glass ONLY (Special order, contact CS)\",IF(AND(TIGMODEL>\"\",TIGBAL=1),\"TIG is NOT Available\",IF(TIG_NOTE>\"\",TIG_NOTE,\"\")))","v":""}]
[null,{"$f":"IF(AND(WSIZE>0,HSIZE>0),\"Only Available At\"&\"  \"&WSIZE&\" x \"&HSIZE&IF(HCONTROL=1,\" or \"&HSIZE2,\"\"),\"\")","v":""},null,null,null,null,null,"Select a Model"]
[null,{"$f":"IF(Model_Select=1,ModelNo,\"(Model\"&\" \"&ModelNo&\")\")","v":"Select a Model"},null,null,null,null,null,null,null,{"$f":"\"Min. W:\"&\" \"&MINW","v":"Min. W: 0"},null,null,null,{"$f":"\"Max W:\"&\" \"&MAXW","v":"Max W: 0"}]
[null,{"$f":"Description","v":0},null,null,null,null,null,null,null,{"$f":"\"Min. H:\"&\" \"&MINH","v":"Min. H: 0"},null,null,null,{"$f":"\"Max H:\"&\" \"&MAXH","v":"Max H: 0"},null,{"$f":"\"Max UI:\"&\" \"&MAXUI","v":"Max UI: 0"}]
[null,{"$f":"IF(AND(W>0,H>0),(IF(ISERROR(VLOOKUP(1,Data!$A:$D,3,FALSE)),\"\",VLOOKUP(1,Data!$A:$D,3,FALSE))),\"\")","v":""},null,null,null,null,null,{"$f":"IF(AND(W>0,H>0),(IF(ISERROR(VLOOKUP(1,Data!$A:$D,4,FALSE)),\"\",VLOOKUP(1,Data!$A:$D,4,FALSE))),\"\")","v":""},null,null,null,null,null,"Exact Size",null,null,null,{"$f":"IF(AND(W>0,H>0),\"DP:\"&\" \"&DP,\"\")","v":""}]
[null,{"$f":"IF(AND(W>0,H>0),(IF(ISERROR(VLOOKUP(2,Data!$A:$D,3,FALSE)),\"\",VLOOKUP(2,Data!$A:$D,3,FALSE))),\"\")","v":""},null,null,null,null,null,{"$f":"IF(AND(W>0,H>0),(IF(ISERROR(VLOOKUP(2,Data!$A:$D,4,FALSE)),\"\",VLOOKUP(2,Data!$A:$D,4,FALSE))),\"\")","v":""},null,"Width:",null,null,null,{"$f":"IF(AND(RO=2,W>0),W-WCUTBACK,W)","v":0},{"$f":"IF(AND(W>0,WSIZE>0,W<>WSIZE),\"<< Width Not Available\",\"\")","v":""}]
[null,{"$f":"IF(AND(W>0,H>0),(IF(ISERROR(VLOOKUP(3,Data!$A:$D,3,FALSE)),\"\",VLOOKUP(3,Data!$A:$D,3,FALSE))),\"\")","v":""},null,null,null,null,null,{"$f":"IF(AND(W>0,H>0),(IF(ISERROR(VLOOKUP(3,Data!$A:$D,4,FALSE)),\"\",VLOOKUP(3,Data!$A:$D,4,FALSE))),\"\")","v":""},null,"Height:",null,null,null,{"$f":"IF(AND(RO=2,H>0),H-HCUTBACK,H)","v":0},{"$f":"IF(AND(H>0,HSIZE>0,H<>HSIZE),\"<< Height Not Available\",\"\")","v":""}]
[null,{"$f":"IF(AND(W>0,H>0),(IF(ISERROR(VLOOKUP(4,Data!$A:$D,3,FALSE)),\"\",VLOOKUP(4,Data!$A:$D,3,FALSE))),\"\")","v":""},null,null,null,null,null,{"$f":"IF(AND(W>0,H>0),(IF(ISERROR(VLOOKUP(4,Data!$A:$D,4,FALSE)),\"\",VLOOKUP(4,Data!$A:$D,4,FALSE))),\"\")","v":""},null,{"$f":"IF(BTYPE=\"Custom\",\"CMR:\",\"\")","v":""},null,null,null,{"$f":"IF(AND(W>0,H>0,BTYPE=\"Custom\",CMR=0),\"<< Enter CMR Location\",\"\")","v":""}]
[null,{"$f":"IF(AND(W>0,H>0),(IF(ISERROR(VLOOKUP(5,Data!$A:$D,3,FALSE)),\"\",VLOOKUP(5,Data!$A:$D,3,FALSE))),\"\")","v":""},null,null,null,null,null,{"$f":"IF(AND(W>0,H>0),(IF(ISERROR(VLOOKUP(5,Data!$A:$D,4,FALSE)),\"\",VLOOKUP(5,Data!$A:$D,4,FALSE))),\"\")","v":""}]
[null,{"$f":"IF(AND(W>0,H>0),(IF(ISERROR(VLOOKUP(6,Data!$A:$D,3,FALSE)),\"\",VLOOKUP(6,Data!$A:$D,3,FALSE))),\"\")","v":""},null,null,null,null,null,{"$f":"IF(AND(W>0,H>0),(IF(ISERROR(VLOOKUP(6,Data!$A:$D,4,FALSE)),\"\",VLOOKUP(6,Data!$A:$D,4,FALSE))),\"\")","v":""},null,{"$f":"IF(ModelNo=\"3001\",\"Reinf:\",\"\")","v":""},null,null,null,{"$f":"IF(AND(W>0,H>0,REINFSELECT=1,ModelNo=\"3001\"),\"<< Must Select\",\"\")","v":""}]
[null,{"$f":"IF(AND(W>0,H>0),(IF(ISERROR(VLOOKUP(7,Data!$A:$D,3,FALSE)),\"\",VLOOKUP(7,Data!$A:$D,3,FALSE))),\"\")","v":""},null,null,null,null,null,{"$f":"IF(AND(W>0,H>0),(IF(ISERROR(VLOOKUP(7,Data!$A:$D,4,FALSE)),\"\",VLOOKUP(7,Data!$A:$D,4,FALSE))),\"\")","v":""},null,"Opening:",null,null,null,{"$f":"RO_OPTION","v":0}]
[null,{"$f":"IF(AND(W>0,H>0),(IF(ISERROR(VLOOKUP(8,Data!$A:$D,3,FALSE)),\"\",VLOOKUP(8,Data!$A:$D,3,FALSE))),\"\")","v":""},null,null,null,null,null,{"$f":"IF(AND(W>0,H>0),(IF(ISERROR(VLOOKUP(8,Data!$A:$D,4,FALSE)),\"\",VLOOKUP(8,Data!$A:$D,4,FALSE))),\"\")","v":""},null,"Type:"]
[null,{"$f":"IF(AND(W>0,H>0),(IF(ISERROR(VLOOKUP(9,Data!$A:$D,3,FALSE)),\"\",VLOOKUP(9,Data!$A:$D,3,FALSE))),\"\")","v":""},null,null,null,null,null,{"$f":"IF(AND(W>0,H>0),(IF(ISERROR(VLOOKUP(9,Data!$A:$D,4,FALSE)),\"\",VLOOKUP(9,Data!$A:$D,4,FALSE))),\"\")","v":""},null,"Screen:"]
[null,{"$f":"IF(AND(W>0,H>0),(IF(ISERROR(VLOOKUP(10,Data!$A:$D,3,FALSE)),\"\",VLOOKUP(10,Data!$A:$D,3,FALSE))),\"\")","v":""},null,null,null,null,null,{"$f":"IF(AND(W>0,H>0),(IF(ISERROR(VLOOKUP(10,Data!$A:$D,4,FALSE)),\"\",VLOOKUP(10,Data!$A:$D,4,FALSE))),\"\")","v":""},null,"Glass:",null,null,null,null,{"$f":"GLASS_MESSAGE","v":0}]
[]
[null,{"$f":"IF(AND(W>0,H>0),(IF(ISERROR(VLOOKUP(11,Data!$A:$D,3,FALSE)),\"\",VLOOKUP(11,Data!$A:$D,3,FALSE))),\"\")","v":""},null,null,null,null,null,{"$f":"IF(AND(W>0,H>0),(IF(ISERROR(VLOOKUP(11,Data!$A:$D,4,FALSE)),\"\",VLOOKUP(11,Data!$A:$D,4,FALSE))),\"\")","v":""},null,null,null,null,"A Designated AC Sash is Used to Replace BOTH Top and Bottom Sashes When AC is in the Window"]
[null,{"$f":"IF(AND(W>0,H>0),(IF(ISERROR(VLOOKUP(12,Data!$A:$D,3,FALSE)),\"\",VLOOKUP(12,Data!$A:$D,3,FALSE))),\"\")","v":""},null,null,null,null,null,{"$f":"IF(AND(W>0,H>0),(IF(ISERROR(VLOOKUP(12,Data!$A:$D,4,FALSE)),\"\",VLOOKUP(12,Data!$A:$D,4,FALSE))),\"\")","v":""}]
[null,{"$f":"IF(AND(W>0,H>0),(IF(ISERROR(VLOOKUP(13,Data!$A:$D,3,FALSE)),\"\",VLOOKUP(13,Data!$A:$D,3,FALSE))),\"\")","v":""},null,null,null,null,null,{"$f":"IF(AND(W>0,H>0),(IF(ISERROR(VLOOKUP(13,Data!$A:$D,4,FALSE)),\"\",VLOOKUP(13,Data!$A:$D,4,FALSE))),\"\")","v":""}]
[null,{"$f":"IF(AND(W>0,H>0),(IF(ISERROR(VLOOKUP(14,Data!$A:$D,3,FALSE)),\"\",VLOOKUP(14,Data!$A:$D,3,FALSE))),\"\")","v":""},null,null,null,null,null,{"$f":"IF(AND(W>0,H>0),(IF(ISERROR(VLOOKUP(14,Data!$A:$D,4,FALSE)),\"\",VLOOKUP(14,Data!$A:$D,4,FALSE))),\"\")","v":""},null,"AC Width:",null,null,null,{"$f":"IF(AND(W>0,H>0,ACWIDTH>0,ACSASHW>0,ACLINK=TRUE),ACSASHW,\"\")","v":""},{"$f":"IF(AND(W>0,H>0,ACWIDTH>0,ACSASHW>0,ACLINK=TRUE),\"<< AC Sash Width\",\"\")","v":""}]
[null,{"$f":"IF(AND(W>0,H>0),(IF(ISERROR(VLOOKUP(15,Data!$A:$D,3,FALSE)),\"\",VLOOKUP(15,Data!$A:$D,3,FALSE))),\"\")","v":""},null,null,null,null,null,{"$f":"IF(AND(W>0,H>0),(IF(ISERROR(VLOOKUP(15,Data!$A:$D,4,FALSE)),\"\",VLOOKUP(15,Data!$A:$D,4,FALSE))),\"\")","v":""},null,"AC Height:",null,null,null,{"$f":"IF(AND(W>0,H>0,ACHEIGHT>0,ACSASHH>0,ACLINK=TRUE),ACSASHH,\"\")","v":""},{"$f":"IF(AND(W>0,H>0,ACHEIGHT>0,ACSASHW>0,ACLINK=TRUE),\"<< AC Sash Height\",\"\")","v":""}]
[null,{"$f":"IF(AND(W>0,H>0),(IF(ISERROR(VLOOKUP(16,Data!$A:$D,3,FALSE)),\"\",VLOOKUP(16,Data!$A:$D,3,FALSE))),\"\")","v":""},null,null,null,null,null,{"$f":"IF(AND(W>0,H>0),(IF(ISERROR(VLOOKUP(16,Data!$A:$D,4,FALSE)),\"\",VLOOKUP(16,Data!$A:$D,4,FALSE))),\"\")","v":""}]
[null,{"$f":"IF(AND(W>0,H>0),(IF(ISERROR(VLOOKUP(17,Data!$A:$D,3,FALSE)),\"\",VLOOKUP(17,Data!$A:$D,3,FALSE))),\"\")","v":""},null,null,null,null,null,{"$f":"IF(AND(W>0,H>0),(IF(ISERROR(VLOOKUP(17,Data!$A:$D,4,FALSE)),\"\",VLOOKUP(17,Data!$A:$D,4,FALSE))),\"\")","v":""}]
[null,{"$f":"IF(AND(W>0,H>0),(IF(ISERROR(VLOOKUP(18,Data!$A:$D,3,FALSE)),\"\",VLOOKUP(18,Data!$A:$D,3,FALSE))),\"\")","v":""},null,null,null,null,null,{"$f":"IF(AND(W>0,H>0),(IF(ISERROR(VLOOKUP(18,Data!$A:$D,4,FALSE)),\"\",VLOOKUP(18,Data!$A:$D,4,FALSE))),\"\")","v":""}]
[null,{"$f":"IF(AND(W>0,H>0),(IF(ISERROR(VLOOKUP(19,Data!$A:$D,3,FALSE)),\"\",VLOOKUP(19,Data!$A:$D,3,FALSE))),\"\")","v":""},null,null,null,null,null,{"$f":"IF(AND(W>0,H>0),(IF(ISERROR(VLOOKUP(19,Data!$A:$D,4,FALSE)),\"\",VLOOKUP(19,Data!$A:$D,4,FALSE))),\"\")","v":""}]

{"sheet":"Balance","index":1,"n_rows":271,"n_cols":34,"rows_kept":271,"cut":false,"hidden":true,"merged":[[25,9,25,10],[9,9,9,10],[1,5,1,12],[1,15,1,16],[0,27,0,31],[1,25,1,28],[1,30,1,33]]}
[null,null,null,null,null,null,null,null,null,null,null,null,null,null,null,null,null,null,null,null,null,null,null,null,null,null,null,"BLOCK & TACKLE BALANCE CHART"]
[null,null,null,"Glass Strength",null,"Weight Calculation",null,null,null,null,null,null,null,null,null,"Egress Calculation",null,null,null,null,null,null,null,null,null,"TOP SASH",null,null,null,null,"BOTTOM SASH"]
[1,"S",{"$f":"1.157*2","v":2.3140000000000001},"Single Strength (2.5 mm)",null,"Model","CDIM","Bott. Sash Height","Bottom Sash Weight","Top Sash Weight","Bal. Loc.",null,null,"EW",null,"Top Sash Height",{"$f":"IF(J18>J19,J18-2.0625,0)","v":0},null,null,"9001","Length","Weight/ft","Weight",null,null,"Sash Weight","Tube Length","Balance","Weight",null,"Sash Weight","Tube Length","Balance","Weight"]
[2,"D",{"$f":"1.6*2","v":3.2},"Double Strength (3 mm)",null,{"$f":"ModelNo","v":"Select a Model"},{"$f":"VLOOKUP(ModelNo,$F$5:$N$7,2,FALSE)","v":{"$error":"#N/A"}},{"$f":"VLOOKUP(ModelNo,$F$5:$N$7,3,FALSE)","v":{"$error":"#N/A"}},{"$f":"VLOOKUP(ModelNo,$F$5:$N$7,4,FALSE)","v":{"$error":"#N/A"}},{"$f":"VLOOKUP(ModelNo,$F$5:$N$7,5,FALSE)","v":{"$error":"#N/A"}},{"$f":"VLOOKUP(ModelNo,$F$5:$N$7,6,FALSE)","v":{"$error":"#N/A"}},{"$f":"VLOOKUP(ModelNo,$F$5:$N$7,7,FALSE)","v":{"$error":"#N/A"}},{"$f":"VLOOKUP(ModelNo,$F$5:$N$7,8,FALSE)","v":{"$error":"#N/A"}},{"$f":"VLOOKUP(ModelNo,$F$5:$N$7,9,FALSE)","v":{"$error":"#N/A"}},null,"Egress Height",{"$f":"IF($Q$3=0,Frame_Height-H4-7.5,IF($Q$3>0,Frame_Height-$Q$3-7.5,0))","v":{"$error":"#N/A"}},null,null,"Top Top Rail",{"$f":"(Frame_Width-4.875)/12","v":-0.40625},0.34100000000000003,{"$f":"U4*V4","v":-0.13853125000000002},null,null,{"$f":"TRUNC(TOP_WGT)","v":{"$error":"#N/A"}},{"$f":"$Z$9","v":{"$error":"#N/A"}},"Number","Range",null,{"$f":"TRUNC(BTM_WGT)","v":{"$error":"#N/A"}},{"$f":"$AE$9","v":-4},"Number","Range"]
[3,"T",{"$f":"2.408*2","v":4.8159999999999998},"Triple Strength (5 mm)",null,"P601",{"$f":"Balance!$J$19","v":0},{"$f":"INT((Balance!$J$19-1.19)*32)/32","v":-1.21875},{"$f":"$W$25","v":0},{"$f":"$W$24","v":0},null,null,null,5.9375,null,"Egress Width",{"$f":"Frame_Width-N4","v":{"$error":"#N/A"}},null,null,"Top Bottom Rail",{"$f":"(Frame_Width-4.875)/12","v":-0.40625},0.38400000000000001,-0.156,null,null,"Balance Size",{"$f":"IF(AND(AB5>0,AC5>0),AB5,0)","v":{"$error":"#N/A"}},{"$f":"IF($AA$4<=6,6,0)","v":{"$error":"#N/A"}},{"$f":"IF(AND(AB5=6,$Z$4>=2,$Z$4<=5),AB5&\"A\",0)","v":{"$error":"#N/A"}},null,"Balance Size",{"$f":"IF(AND(AG5>0,AH5>0),AG5,0)","v":{"$error":"#N/A"}},{"$f":"IF($AF$4<=6,6,0)","v":6},{"$f":"IF(AND(AG5=6,$AE$4>=2,$AE$4<=5),AG5&\"A\",0)","v":{"$error":"#N/A"}}]
[4,"L",{"$f":"2.683*2","v":5.3659999999999997},"Laminated",null,"9001",{"$f":"Balance!$J$19","v":0},{"$f":"INT((Balance!$J$19-1.19)*32)/32","v":-1.21875},{"$f":"$W$25","v":0},{"$f":"$W$24","v":0},null,null,null,5.9375,null,"Egress Area",{"$f":"ROUND(((EH*EW)/144),3)","v":{"$error":"#N/A"}},null,null,"Top Stile",{"$f":"(2*(Balance!$J$18-2.19))/12","v":-0.36499999999999999},0.311,-0.11351499999999999,null,null,{"$f":"VLOOKUP((MAX(AA5:AA271)),AA5:AC271,3,FALSE)","v":{"$error":"#N/A"}},{"$error":"#N/A"},{"$error":"#N/A"},{"$f":"IF(AND(AB6=6,$Z$4>=6,$Z$4<=9),AB6&\"B\",0)","v":{"$error":"#N/A"}},null,{"$f":"VLOOKUP((MAX(AF5:AF271)),AF5:AH271,3,FALSE)","v":{"$error":"#N/A"}},{"$error":"#N/A"},6,{"$f":"IF(AND(AG6=6,$AE$4>=6,$AE$4<=9),AG6&\"B\",0)","v":{"$error":"#N/A"}}]
[5,"STG",{"$f":"1.157*3","v":3.4710000000000001},"Triple IG Single Strength",null,"3001",{"$f":"CDIM3001","v":0},{"$f":"CDIM3001-0.625","v":-0.625},{"$f":"BSW_3001","v":0},{"$f":"TSW_3001","v":0},null,null,null,5.25,null,null,null,null,null,"Keeper Rail Reinf.",{"$f":"IF((INT((Frame_Width-9.875)/2)*2)>6,(INT((Frame_Width-9.875)/2)*2)/12,0)","v":0},3.9E-2,0,null,null,null,{"$error":"#N/A"},{"$error":"#N/A"},{"$f":"IF(AND(AB7=6,$Z$4>=10,$Z$4<=12),AB7&\"C\",0)","v":{"$error":"#N/A"}},null,null,{"$error":"#N/A"},6,{"$f":"IF(AND(AG7=6,$AE$4>=10,$AE$4<=12),AG7&\"C\",0)","v":{"$error":"#N/A"}}]
[6,"TDG",{"$f":"1.6*3","v":4.8000000000000007},"Triple IG Double Strength",null,null,null,null,null,null,null,null,null,null,null,null,null,null,null,"Keeper Bead",{"$f":"(Frame_Width-6.072)/12","v":-0.50600000000000001},9.7000000000000003E-2,-4.9082000000000001E-2,null,null,"Top Tube length",{"$error":"#N/A"},{"$error":"#N/A"},{"$f":"IF(AND(AB8=6,$Z$4>=13,$Z$4<=15),AB8&\"D\",0)","v":{"$error":"#N/A"}},null,"Bott. Tube Length",{"$error":"#N/A"},6,{"$f":"IF(AND(AG8=6,$AE$4>=13,$AE$4<=15),AG8&\"D\",0)","v":{"$error":"#N/A"}}]
[null,null,null,2,null,null,null,null,null,null,null,null,null,null,null,null,null,null,null,"Top Glass",{"$f":"(Balance!$J$21*Balance!$J$23)/144","v":0.18517388237847221},{"$f":"$C$10","v":3.2},0.59255642361111105,null,{"$f":"ModelNo","v":"Select a Model"},{"$f":"VLOOKUP(Y9,Y10:Z12,2,FALSE)","v":{"$error":"#N/A"}},{"$error":"#N/A"},{"$error":"#N/A"},{"$f":"IF(AND(AB9=6,$Z$4>=16,$Z$4<=20),AB9&\"E\",0)","v":{"$error":"#N/A"}},{"$f":"ModelNo","v":"Select a Model"},{"$f":"(INT(INT((Frame_Height/2-2.75)+0.25)/2)*2)","v":-4},{"$error":"#N/A"},6,{"$f":"IF(AND(AG9=6,$AE$4>=16,$AE$4<=20),AG9&\"E\",0)","v":{"$error":"#N/A"}}]
[null,null,{"$f":"VLOOKUP(Glass,A3:C8,3,FALSE)","v":3.2},{"$f":"VLOOKUP(Glass,A3:C8,2,FALSE)","v":"D"},null,null,null,"W",null,"9001",null,null,null,null,null,null,null,null,null,"Top Spacer",{"$f":"((Balance!$J$21*2)+(Balance!$J$23*2))/12","v":-1.78125},5.3600000000000002E-2,-9.5475000000000004E-2,null,"9001",{"$f":"IF(J18>=Frame_Height/2-0.07,(INT(INT((Frame_Height/2-4.75)+0.25)/2))*2,(INT(INT((J18-4.75)+0.25)/2))*2)","v":-6},{"$error":"#N/A"},{"$error":"#N/A"},{"$f":"IF(AND(AB10=6,$Z$4>=21,$Z$4<=24,ModelNo=\"9001\"),\"Dbl.\"&AB10&\"C\",0)","v":{"$error":"#N/A"}},"9001",{"$f":"(INT(INT((Frame_Height/2-2.75)+0.25)/2)*2)","v":-4},{"$error":"#N/A"},6,{"$f":"IF(AND(AG10=6,$AE$4>=21,$AE$4<=24,ModelNo=\"9001\"),\"Dbl.\"&AG10&\"C\",0)","v":{"$error":"#N/A"}}]
[null,null,null,null,null,null,null,{"$f":"IF(TYPE=1,H10,IF(TYPE= \"\",H10,\" \"))","v":"W"},1,{"$f":"Frame_Height/2","v":0},{"$f":"TRUNC(J11*16+0.5)/16","v":0},null,null,null,null,null,null,null,null,"Top Hardware",1,0.2,0.2,null,"3001",{"$f":"IF(DDIM3001>=(Frame_Height/2),FLOOR((Frame_Height/2)-4.75,2),FLOOR(DDIM3001-4.75,2))","v":-6},{"$error":"#N/A"},{"$error":"#N/A"},{"$f":"IF(AND(AB11=6,$Z$4>=25,$Z$4<=30,ModelNo=\"9001\"),\"Dbl.\"&AB11&\"D\",0)","v":{"$error":"#N/A"}},"3001",{"$f":"FLOOR(Frame_Height/2-2.25,2)","v":-4},{"$error":"#N/A"},6,{"$f":"IF(AND(AG11=6,$AE$4>=25,$AE$4<=30,ModelNo=\"9001\"),\"Dbl.\"&AG11&\"D\",0)","v":{"$error":"#N/A"}}]
[null,null,null,"Type",null,null,null,{"$f":"IF(TYPE=5,H10,IF(TYPE=2,IF(Frame_Height>=54.5,IF(Frame_Height<72.5,H10,\"\"),\"\"),\"\"))","v":""},2,{"$f":"CEILING(((Frame_Height/5-0.24)*3-0.03125),0.0625)","v":-0.75},-0.6875,5,null,null,null,null,null,null,null,"Top Handle Bead",{"$f":"(Frame_Width-6.072)/12","v":-0.50600000000000001},9.7000000000000003E-2,-4.9082000000000001E-2,null,"P601",{"$f":"IF(J18>=Frame_Height/2-0.07,(INT(INT((Frame_Height/2-4.75)+0.25)/2))*2,(INT(INT((J18-4.75)+0.25)/2))*2)","v":-6},{"$error":"#N/A"},{"$error":"#N/A"},{"$f":"IF(AND(AB12=6,$Z$4>=31,$Z$4<=40,ModelNo=\"9001\"),\"Dbl.\"&AB12&\"E\",0)","v":{"$error":"#N/A"}},null,null,{"$error":"#N/A"},6,{"$f":"IF(AND(AG12=6,$AE$4>=31,$AE$4<=40,ModelNo=\"9001\"),\"Dbl.\"&AG12&\"E\",0)","v":{"$error":"#N/A"}}]
[null,null,1,{"$f":"IF(TYPE1>\"\",TYPE1,\"\")","v":""},null,null,null,{"$f":"IF(TYPE=6,H10,IF(AND(TYPE=2,OR(Frame_Height<54.5,Frame_Height>=72.5)),H10,\"\"))","v":""},null,{"$f":"TRUNC((Frame_Height/3-0.62)*32+0.5)/16","v":-1.1875},-1.125,6,null,null,null,null,null,null,null,"Top Vertical Beads",{"$f":"((Balance!$J$18-3.387)*2)/12","v":-0.5645},9.7000000000000003E-2,-5.47565E-2,null,null,null,{"$error":"#N/A"},{"$f":"IF(AND($AA$4<=8,$AA$4>6),8,0)","v":{"$error":"#N/A"}},{"$f":"IF(AND(AB13=8,$Z$4>=2,$Z$4<=6),AB13&\"A\",0)","v":{"$error":"#N/A"}},null,null,{"$error":"#N/A"},{"$f":"IF(AND($AF$4<=8,$AF$4>6),8,0)","v":0},{"$f":"IF(AND(AG13=8,$AE$4>=2,$AE$4<=6),AG13&\"A\",0)","v":{"$error":"#N/A"}}]
[null,null,2,{"$f":"IF(TYPE2>\"\",TYPE2,\"\")","v":""},null,null,null,{"$f":"IF(TYPE=7,H10,IF(TYPE=3,IF(Frame_Height>=54.5,IF(Frame_Height<72.5,H10,\"\"),\"\"),\"\"))","v":""},3,{"$f":"TRUNC((Frame_Height/5+0.38)*32+0.5)/16","v":0.75},0.75,7,null,null,null,null,null,null,null,"Bottom Top Rail",{"$f":"(Frame_Width-3.875)/12","v":-0.32291666666666669},0.42799999999999999,-0.13820833333333335,null,null,null,{"$error":"#N/A"},{"$error":"#N/A"},{"$f":"IF(AND(AB14=8,$Z$4>=7,$Z$4<=10),AB14&\"B\",0)","v":{"$error":"#N/A"}},null,null,{"$error":"#N/A"},0,{"$f":"IF(AND(AG14=8,$AE$4>=7,$AE$4<=10),AG14&\"B\",0)","v":{"$error":"#N/A"}}]
[null,null,3,{"$f":"IF(TYPE3>\"\",TYPE3,\"\")","v":""},null,null,null,{"$f":"IF(TYPE=8,H10,IF(AND(TYPE=3,OR(Frame_Height<54.5,Frame_Height>=72.5)),H10,\"\"))","v":""},null,{"$f":"TRUNC((Frame_Height/3+1.3)*16+0.5)/16","v":1.3125},1.3125,8,null,null,null,null,null,null,null,"Bottom Bottom Rail",{"$f":"(Frame_Width-3.875)/12","v":-0.32291666666666669},0.443,-0.14305208333333333,null,null,null,{"$error":"#N/A"},{"$error":"#N/A"},{"$f":"IF(AND(AB15=8,$Z$4>=11,$Z$4<=13),AB15&\"C\",0)","v":{"$error":"#N/A"}},null,null,{"$error":"#N/A"},0,{"$f":"IF(AND(AG15=8,$AE$4>=11,$AE$4<=13),AG15&\"C\",0)","v":{"$error":"#N/A"}}]
[null,null,4,{"$f":"IF(TYPE4>\"\",TYPE4,\"\")","v":""},null,null,null,{"$f":"IF(TYPE=4,H10,\"\")","v":""},4,{"$f":"CMR","v":0},0,null,null,null,null,null,null,null,null,"Bottom Stile",{"$f":"(2*(Balance!$J$19-1.19))/12","v":-0.19833333333333333},0.378,-7.4969999999999995E-2,null,null,null,{"$error":"#N/A"},{"$error":"#N/A"},{"$f":"IF(AND(AB16=8,$Z$4>=14,$Z$4<=15),AB16&\"D\",0)","v":{"$error":"#N/A"}},null,null,{"$error":"#N/A"},0,{"$f":"IF(AND(AG16=8,$AE$4>=14,$AE$4<=15),AG16&\"D\",0)","v":{"$error":"#N/A"}}]
[null,null,1,{"$f":"VLOOKUP(TYPE,C13:D16,2,FALSE)","v":""},null,null,null,null,null,null,null,null,null,null,null,null,null,null,null,"Lock Rail Reinf.",{"$f":"IF((INT((Frame_Width-8.197)/2)*2)>6,(INT((Frame_Width-8.197)/2)*2)/12,0)","v":0},0.31840000000000002,0,null,null,null,{"$error":"#N/A"},{"$error":"#N/A"},{"$f":"IF(AND(AB17=8,$Z$4>=16,$Z$4<=18),AB17&\"E\",0)","v":{"$error":"#N/A"}},null,null,{"$error":"#N/A"},0,{"$f":"IF(AND(AG17=8,$AE$4>=16,$AE$4<=18),AG17&\"E\",0)","v":{"$error":"#N/A"}}]
[null,null,null,null,null,null,null,"Dim.,\"D\"","=",{"$f":"IF(H11=H10,K11,IF(H12=H10,K12,IF(H13=H10,K13,IF(H14=H10,K14,IF(H15=H10,K15,IF(H16=H10,K16,K11))))))","v":0},null,null,null,null,null,null,null,null,null,"Bottom Stile Reinf.",0,0,0,null,null,null,{"$error":"#N/A"},{"$error":"#N/A"},{"$f":"IF(AND(AB18=8,$Z$4>=19,$Z$4<=20,ModelNo=\"9001\"),\"Dbl.\"&AB18&\"B\",0)","v":{"$error":"#N/A"}},null,null,{"$error":"#N/A"},0,{"$f":"IF(AND(AG18=8,$AE$4>=19,$AE$4<=20,ModelNo=\"9001\"),\"Dbl.\"&AG18&\"B\",0)","v":{"$error":"#N/A"}}]
[null,null,null,"Opening",null,null,null,"Dim.,\"C\"","=",{"$f":"Frame_Height-J18","v":0},null,null,null,null,null,null,null,null,null,"Bottom Glass",{"$f":"(Balance!$J$22*Balance!$J$24)/144","v":0.18517388237847221},{"$f":"$C$10","v":3.2},0.59255642361111105,null,null,null,{"$error":"#N/A"},{"$error":"#N/A"},{"$f":"IF(AND(AB19=8,$Z$4>=21,$Z$4<=26,ModelNo=\"9001\"),\"Dbl.\"&AB19&\"C\",0)","v":{"$error":"#N/A"}},null,null,{"$error":"#N/A"},0,{"$f":"IF(AND(AG19=8,$AE$4>=21,$AE$4<=26,ModelNo=\"9001\"),\"Dbl.\"&AG19&\"C\",0)","v":{"$error":"#N/A"}}]
[null,null,1,"Exact Size",null,null,null,null,null,null,null,null,null,null,null,null,null,null,null,"Bottom Spacer",{"$f":"((Balance!$J$22*2)+(Balance!$J$24*2))/12","v":-1.78125},5.3600000000000002E-2,-9.5475000000000004E-2,null,null,null,{"$error":"#N/A"},{"$error":"#N/A"},{"$f":"IF(AND(AB20=8,$Z$4>=27,$Z$4<=32,ModelNo=\"9001\"),\"Dbl.\"&AB20&\"D\",0)","v":{"$error":"#N/A"}},null,null,{"$error":"#N/A"},0,{"$f":"IF(AND(AG20=8,$AE$4>=27,$AE$4<=32,ModelNo=\"9001\"),\"Dbl.\"&AG20&\"D\",0)","v":{"$error":"#N/A"}}]
[null,null,2,"Rough Opening",null,null,null,null,"Top Glass Width",{"$f":"TRUNC((Frame_Width-6.75)*32+0.5)/32","v":-6.71875},null,null,null,null,null,null,null,null,null,"Bottom Hardware",1,0.36,0.36,null,null,null,{"$error":"#N/A"},{"$error":"#N/A"},{"$f":"IF(AND(AB21=8,$Z$4>=33,$Z$4<=36,ModelNo=\"9001\"),\"Dbl.\"&AB21&\"E\",0)","v":{"$error":"#N/A"}},null,null,{"$error":"#N/A"},0,{"$f":"IF(AND(AG21=8,$AE$4>=33,$AE$4<=36,ModelNo=\"9001\"),\"Dbl.\"&AG21&\"E\",0)","v":{"$error":"#N/A"}}]
[null,null,1,{"$f":"VLOOKUP(RO,C20:D21,2,FALSE)","v":"Exact Size"},null,null,null,null,"Bottom Glass Width",{"$f":"TRUNC((Frame_Width-6.75)*32+0.5)/32","v":-6.71875},null,null,null,null,null,null,null,null,null,"Bott. Horz. Beads",{"$f":"((Frame_Width-6.072)*2)/12","v":-1.012},9.7000000000000003E-2,-9.8164000000000001E-2,null,null,null,{"$error":"#N/A"},{"$f":"IF(AND($AA$4<=10,$AA$4>8),10,0)","v":{"$error":"#N/A"}},{"$f":"IF(AND(AB22=10,$Z$4>=1,$Z$4<=6),AB22&\"A\",0)","v":{"$error":"#N/A"}},null,null,{"$error":"#N/A"},{"$f":"IF(AND($AF$4<=10,$AF$4>8),10,0)","v":0},{"$f":"IF(AND(AG22=10,$AE$4>=1,$AE$4<=6),AG22&\"A\",0)","v":{"$error":"#N/A"}}]
[null,null,null,null,null,null,null,null,"Top Glass Height",{"$f":"TRUNC((J18-4.004)*32+0.5)/32","v":-3.96875},null,null,null,null,null,null,null,null,null,"Bottom Vert. Beads",{"$f":"((Balance!$J$19-3.387)*2)/12","v":-0.5645},9.7000000000000003E-2,-5.47565E-2,null,null,null,{"$error":"#N/A"},{"$error":"#N/A"},{"$f":"IF(AND(AB23=10,$Z$4>=7,$Z$4<=10),AB23&\"B\",0)","v":{"$error":"#N/A"}},null,null,{"$error":"#N/A"},0,{"$f":"IF(AND(AG23=10,$AE$4>=7,$AE$4<=10),AG23&\"B\",0)","v":{"$error":"#N/A"}}]
[null,null,{"$f":"IF(OR(ModelNo=\"0100\",ModelNo=\"01HP\",ModelNo=\"0102\",ModelNo=\"0103\",ModelNo=\"0104\",ModelNo=\"0109\",ModelNo=\"0151\",ModelNo=\"0152\",ModelNo=\"0153\",ModelNo=\"0154\",ModelNo=\"0155\",ModelNo=\"0170\",ModelNo=\"0171\",ModelNo=\"0172\",ModelNo=\"0173\",ModelNo=\"S174\",ModelNo=\"S175\",ModelNo=\"0179\",ModelNo=\"0301\"),1,0)","v":0},"Screen",null,null,null,null,"Bottom Glass Height",{"$f":"TRUNC((J19-4.004)*32+0.5)/32","v":-3.96875},null,null,null,null,null,null,null,null,null,null,null,"Top Sash",{"$f":"IF(OR(ModelNo=\"9001\",ModelNo=\"P601\"),(TRUNC((SUM(W4:W13))))+6.5,0)","v":0},null,null,null,{"$error":"#N/A"},{"$error":"#N/A"},{"$f":"IF(AND(AB24=10,$Z$4>=11,$Z$4<=13),AB24&\"C\",0)","v":{"$error":"#N/A"}},null,null,{"$error":"#N/A"},0,{"$f":"IF(AND(AG24=10,$AE$4>=11,$AE$4<=13),AG24&\"C\",0)","v":{"$error":"#N/A"}}]
[null,null,1,{"$f":"IF(SCREEN1>\"\",SCREEN1,\"\")","v":""},null,null,null,null,null,null,null,null,null,null,null,null,null,null,null,null,null,"Bottom Sash",{"$f":"IF(OR(ModelNo=\"9001\",ModelNo=\"P601\"),TRUNC((SUM(W14:W23))),0)","v":0},null,null,null,{"$error":"#N/A"},{"$error":"#N/A"},{"$f":"IF(AND(AB25=10,$Z$4>=14,$Z$4<=16),AB25&\"D\",0)","v":{"$error":"#N/A"}},null,null,{"$error":"#N/A"},0,{"$f":"IF(AND(AG25=10,$AE$4>=14,$AE$4<=16),AG25&\"D\",0)","v":{"$error":"#N/A"}}]
[null,null,2,{"$f":"IF(SCREEN2>\"\",SCREEN2,\"\")","v":""},null,null,null,"W",null,"3001",null,null,null,null,null,null,null,null,null,null,null,null,null,null,null,null,{"$error":"#N/A"},{"$error":"#N/A"},{"$f":"IF(AND(AB26=10,$Z$4>=17,$Z$4<=19),AB26&\"E\",0)","v":{"$error":"#N/A"}},null,null,{"$error":"#N/A"},0,{"$f":"IF(AND(AG26=10,$AE$4>=17,$AE$4<=19),AG26&\"E\",0)","v":{"$error":"#N/A"}}]
[null,null,3,{"$f":"IF(SCREEN3>\"\",SCREEN3,\"\")","v":""},null,null,null,{"$f":"IF(TYPE=1,H26,IF(TYPE= \"\",H26,\" \"))","v":"W"},1,{"$f":"Frame_Height/2","v":0},{"$f":"TRUNC(J27*16+0.5)/16","v":0},null,null,null,null,null,null,null,null,null,null,null,null,null,null,null,{"$error":"#N/A"},{"$error":"#N/A"},{"$f":"IF(AND(AB27=10,$Z$4=20,ModelNo=\"9001\"),\"Dbl.\"&AB27&\"B\",0)","v":{"$error":"#N/A"}},null,null,{"$error":"#N/A"},0,{"$f":"IF(AND(AG27=10,$AE$4=20,ModelNo=\"9001\"),\"Dbl.\"&AG27&\"B\",0)","v":{"$error":"#N/A"}}]
[null,null,1,{"$f":"VLOOKUP(Screen_Type,C25:D27,2,FALSE)","v":""},null,null,null,{"$f":"IF(TYPE=5,H26,IF(TYPE=2,IF(Frame_Height>=54.5,IF(Frame_Height<72.5,H26,\"\"),\"\"),\"\"))","v":""},2,{"$f":"CEILING(((Frame_Height/5-0.24)*3-0.03125),0.0625)","v":-0.75},-0.6875,5,null,null,null,null,null,null,null,null,null,null,null,null,null,null,{"$error":"#N/A"},{"$error":"#N/A"},{"$f":"IF(AND(AB28=10,$Z$4>=21,$Z$4<=26,ModelNo=\"9001\"),\"Dbl.\"&AB28&\"C\",0)","v":{"$error":"#N/A"}},null,null,{"$error":"#N/A"},0,{"$f":"IF(AND(AG28=10,$AE$4>=21,$AE$4<=26,ModelNo=\"9001\"),\"Dbl.\"&AG28&\"C\",0)","v":{"$error":"#N/A"}}]
[null,null,null,null,null,null,null,{"$f":"IF(TYPE=6,H26,IF(AND(TYPE=2,OR(Frame_Height<54.5,Frame_Height>=72.5)),H26,\"\"))","v":""},null,{"$f":"TRUNC((Frame_Height/3-0.62)*32+0.5)/16","v":-1.1875},-1.125,6,null,null,null,null,null,null,null,"3001","Length","Weight/ft","Weight",null,null,null,{"$error":"#N/A"},{"$error":"#N/A"},{"$f":"IF(AND(AB29=10,$Z$4>=27,$Z$4<=32,ModelNo=\"9001\"),\"Dbl.\"&AB29&\"D\",0)","v":{"$error":"#N/A"}},null,null,{"$error":"#N/A"},0,{"$f":"IF(AND(AG29=10,$AE$4>=27,$AE$4<=32,ModelNo=\"9001\"),\"Dbl.\"&AG29&\"D\",0)","v":{"$error":"#N/A"}}]
[null,null,null,null,null,null,null,{"$f":"IF(TYPE=7,H26,IF(TYPE=3,IF(Frame_Height>=54.5,IF(Frame_Height<72.5,H26,\"\"),\"\"),\"\"))","v":""},3,{"$f":"TRUNC((Frame_Height/5+0.38)*32+0.5)/16","v":0.75},0.75,7,null,null,null,null,null,null,null,"Top Top Rail",{"$f":"(Frame_Width-4.125)/12","v":-0.34375},0.29699999999999999,{"$f":"U30*V30","v":-0.10209375},null,null,null,{"$error":"#N/A"},{"$error":"#N/A"},{"$f":"IF(AND(AB30=10,$Z$4>=33,$Z$4<=38,ModelNo=\"9001\"),\"Dbl.\"&AB30&\"E\",0)","v":{"$error":"#N/A"}},null,null,{"$error":"#N/A"},0,{"$f":"IF(AND(AG30=10,$AE$4>=33,$AE$4<=38,ModelNo=\"9001\"),\"Dbl.\"&AG30&\"E\",0)","v":{"$error":"#N/A"}}]
[null,null,1,{"$f":"IF(ModelNo=\"3001\",\"Select Reinforcement\",\"\")","v":""},null,null,null,{"$f":"IF(TYPE=8,H26,IF(AND(TYPE=3,OR(Frame_Height<54.5,Frame_Height>=72.5)),H26,\"\"))","v":""},null,{"$f":"TRUNC((Frame_Height/3+1.3)*16+0.5)/16","v":1.3125},1.3125,8,null,null,null,null,null,null,null,"Top Bottom Rail",{"$f":"(Frame_Width-4.125)/12","v":-0.34375},0.28899999999999998,-9.9343749999999995E-2,null,null,null,{"$error":"#N/A"},{"$f":"IF(AND($AA$4<=12,$AA$4>10),12,0)","v":{"$error":"#N/A"}},{"$f":"IF(AND(AB31=12,$Z$4>=3,$Z$4<=7),AB31&\"A\",0)","v":{"$error":"#N/A"}},null,null,{"$error":"#N/A"},{"$f":"IF(AND($AF$4<=12,$AF$4>10),12,0)","v":0},{"$f":"IF(AND(AG31=12,$AE$4>=3,$AE$4<=7),AG31&\"A\",0)","v":{"$error":"#N/A"}}]
[null,null,2,{"$f":"IF(ModelNo=\"3001\",\"Composite\",\"\")","v":""},null,null,null,{"$f":"IF(TYPE=4,H26,\"\")","v":""},4,{"$f":"CMR","v":0},0,null,null,null,null,null,null,null,null,"Top Stile",{"$f":"(2*(DDIM3001-1.625))/12","v":-0.27083333333333331},0.218,-5.9041666666666666E-2,null,null,null,{"$error":"#N/A"},{"$error":"#N/A"},{"$f":"IF(AND(AB32=12,$Z$4>=8,$Z$4<=10),AB32&\"B\",0)","v":{"$error":"#N/A"}},null,null,{"$error":"#N/A"},0,{"$f":"IF(AND(AG32=12,$AE$4>=8,$AE$4<=10),AG32&\"B\",0)","v":{"$error":"#N/A"}}]
[null,null,3,{"$f":"IF(ModelNo=\"3001\",\"Steel\",\"\")","v":""},null,null,null,null,null,null,null,null,null,null,null,null,null,null,null,"Keeper Rail Reinf.",{"$f":"(TRUNC(((Frame_Width-4.125)-2)/2)*2)/12","v":-0.5},{"$f":"IF(OR(REINFSELECT=2,Frame_Width<48,Frame_Height<84),0.0516,IF(OR(REINFSELECT=3,Frame_Width>48,Frame_Height>84),0.3784,0))","v":5.16E-2},-2.58E-2,null,null,null,{"$error":"#N/A"},{"$error":"#N/A"},{"$f":"IF(AND(AB33=12,$Z$4>=11,$Z$4<=16),AB33&\"C\",0)","v":{"$error":"#N/A"}},null,null,{"$error":"#N/A"},0,{"$f":"IF(AND(AG33=12,$AE$4>=11,$AE$4<=16),AG33&\"C\",0)","v":{"$error":"#N/A"}}]
[null,null,1,{"$f":"VLOOKUP(REINFSELECT,C31:D33,2,FALSE)","v":""},null,null,null,"Dim.,\"D\"","=",{"$f":"IF(H27=H26,K27,IF(H28=H26,K28,IF(H29=H26,K29,IF(H30=H26,K30,IF(H31=H26,K31,IF(H32=H26,K32,K27))))))","v":0},null,null,null,null,null,null,null,null,null,"Top Stile Reinf",{"$f":"IF(OR(Frame_Width>48,Frame_Height>84,REINFORCEMENT=\"Steel\"),((TRUNC(((DDIM3001-1.625)-8)/2)*2)/12)*2,0)","v":0},0.45600000000000002,0,null,null,null,{"$error":"#N/A"},{"$error":"#N/A"},{"$f":"IF(AND(AB34=12,$Z$4>=17,$Z$4<=18),AB34&\"D\",0)","v":{"$error":"#N/A"}},null,null,{"$error":"#N/A"},0,{"$f":"IF(AND(AG34=12,$AE$4>=17,$AE$4<=18),AG34&\"D\",0)","v":{"$error":"#N/A"}}]
[null,null,null,null,null,null,null,"Dim.,\"C\"","=",{"$f":"Frame_Height-J34","v":0},null,null,null,null,null,null,null,null,null,"Top Glass",{"$f":"(TGW_3001*TGH_3001)/144","v":0.12852647569444445},{"$f":"$C$10","v":3.2},0.41128472222222223,null,null,null,{"$error":"#N/A"},{"$error":"#N/A"},{"$f":"IF(AND(AB35=12,$Z$4>=19,$Z$4<=21),AB35&\"E\",0)","v":{"$error":"#N/A"}},null,null,{"$error":"#N/A"},0,{"$f":"IF(AND(AG35=12,$AE$4>=19,$AE$4<=21),AG35&\"E\",0)","v":{"$error":"#N/A"}}]
[null,null,null,null,null,null,null,null,null,null,null,null,null,null,null,null,null,null,null,"Top Spacer",{"$f":"((TGW_3001*2)+(TGH_3001*2))/12","v":-1.4947916666666667},5.3600000000000002E-2,-8.0120833333333336E-2,null,null,null,{"$error":"#N/A"},{"$error":"#N/A"},{"$f":"IF(AND(AB36=12,$Z$4>=22,$Z$4<=32,ModelNo=\"9001\"),\"Dbl.\"&AB36&\"C\",0)","v":{"$error":"#N/A"}},null,null,{"$error":"#N/A"},0,{"$f":"IF(AND(AG36=12,$AE$4>=22,$AE$4<=32,ModelNo=\"9001\"),\"Dbl.\"&AG36&\"C\",0)","v":{"$error":"#N/A"}}]
[null,null,null,null,null,null,null,null,"Top Glass Width",{"$f":"TRUNC((Frame_Width-5.8125)*16+0.5)/16","v":-5.75},null,null,null,null,null,null,null,null,null,"Top Hardware",1,0.4,0.4,null,null,null,{"$error":"#N/A"},{"$error":"#N/A"},{"$f":"IF(AND(AB37=12,$Z$4>=33,$Z$4<=36,ModelNo=\"9001\"),\"Dbl.\"&AB37&\"D\",0)","v":{"$error":"#N/A"}},null,null,{"$error":"#N/A"},0,{"$f":"IF(AND(AG37=12,$AE$4>=33,$AE$4<=36,ModelNo=\"9001\"),\"Dbl.\"&AG37&\"D\",0)","v":{"$error":"#N/A"}}]
[null,null,null,null,null,null,null,null,"Bottom Glass Width",{"$f":"TRUNC((Frame_Width-4.8125)*16+0.5)/16","v":-4.75},null,null,null,null,null,null,null,null,null,"Top Bead",{"$f":"(((Frame_Width-5.125)*2)+((DDIM3001-4.3125)*2))/12","v":-1.5729166666666667},7.1999999999999995E-2,-0.11325,null,null,null,{"$error":"#N/A"},{"$error":"#N/A"},{"$f":"IF(AND(AB38=12,$Z$4>=37,$Z$4<=42,ModelNo=\"9001\"),\"Dbl.\"&AB38&\"E\",0)","v":{"$error":"#N/A"}},null,null,{"$error":"#N/A"},0,{"$f":"IF(AND(AG38=12,$AE$4>=37,$AE$4<=42,ModelNo=\"9001\"),\"Dbl.\"&AG38&\"E\",0)","v":{"$error":"#N/A"}}]
[null,null,null,null,null,null,null,null,"Top Glass Height",{"$f":"TRUNC((J34-3.25)*32+0.5)/32","v":-3.21875},null,null,null,null,null,null,null,null,null,"Bottom Top Rail",{"$f":"(Frame_Width-3.125)/12","v":-0.26041666666666669},0.29699999999999999,-7.7343750000000003E-2,null,null,null,{"$error":"#N/A"},{"$f":"IF(AND($AA$4<=14,$AA$4>12),14,0)","v":{"$error":"#N/A"}},{"$f":"IF(AND(AB39=14,$Z$4>=3,$Z$4<=7),AB39&\"A\",0)","v":{"$error":"#N/A"}},null,null,{"$error":"#N/A"},{"$f":"IF(AND($AF$4<=14,$AF$4>12),14,0)","v":0},{"$f":"IF(AND(AG39=14,$AE$4>=3,$AE$4<=7),AG39&\"A\",0)","v":{"$error":"#N/A"}}]
[null,null,null,null,null,null,null,null,"Bottom Glass Height",{"$f":"TRUNC((J35-2.25)*32+0.5)/32","v":-2.21875},null,null,null,null,null,null,null,null,null,"Bottom Bottom Rail",{"$f":"(Frame_Width-3.125)/12","v":-0.26041666666666669},0.23200000000000001,-6.0416666666666674E-2,null,null,null,{"$error":"#N/A"},{"$error":"#N/A"},{"$f":"IF(AND(AB40=14,$Z$4>=8,$Z$4<=10),AB40&\"B\",0)","v":{"$error":"#N/A"}},null,null,{"$error":"#N/A"},0,{"$f":"IF(AND(AG40=14,$AE$4>=8,$AE$4<=10),AG40&\"B\",0)","v":{"$error":"#N/A"}}]
[null,null,null,null,null,null,null,null,null,null,null,null,null,null,null,null,null,null,null,"Bottom Stile",{"$f":"(2*(CDIM3001-0.625))/12","v":-0.10416666666666667},0.219,-2.2812499999999999E-2,null,null,null,{"$error":"#N/A"},{"$error":"#N/A"},{"$f":"IF(AND(AB41=14,$Z$4>=11,$Z$4<=16),AB41&\"C\",0)","v":{"$error":"#N/A"}},null,null,{"$error":"#N/A"},0,{"$f":"IF(AND(AG41=14,$AE$4>=11,$AE$4<=16),AG41&\"C\",0)","v":{"$error":"#N/A"}}]
[null,null,null,null,null,null,null,null,null,null,null,null,null,null,null,null,null,null,null,"Bottom Rail Reinf.",{"$f":"(TRUNC(((Frame_Width-3.125)-6)/2)*2)/12","v":-0.66666666666666663},{"$f":"IF(OR(REINFSELECT=2,Frame_Width<48,Frame_Height<84),0.0516,IF(OR(REINFSELECT=3,Frame_Width>48,Frame_Height>84),0.57,0))","v":5.16E-2},-3.44E-2,null,null,null,{"$error":"#N/A"},{"$error":"#N/A"},{"$f":"IF(AND(AB42=14,$Z$4>=17,$Z$4<=19),AB42&\"D\",0)","v":{"$error":"#N/A"}},null,null,{"$error":"#N/A"},0,{"$f":"IF(AND(AG42=14,$AE$4>=17,$AE$4<=19),AG42&\"D\",0)","v":{"$error":"#N/A"}}]
[null,null,null,null,null,null,null,null,null,null,null,null,null,null,null,null,null,null,null,"Bottom Stile Reinf.",{"$f":"IF(OR(Frame_Width>48,Frame_Height>84,REINFORCEMENT=\"Steel\"),((TRUNC((CDIM3001-2)/2)*2)/12)*2,0)","v":0},0.45600000000000002,0,null,null,null,{"$error":"#N/A"},{"$error":"#N/A"},{"$f":"IF(AND(AB43=14,$Z$4>=20,$Z$4<=22),AB43&\"E\",0)","v":{"$error":"#N/A"}},null,null,{"$error":"#N/A"},0,{"$f":"IF(AND(AG43=14,$AE$4>=20,$AE$4<=22),AG43&\"E\",0)","v":{"$error":"#N/A"}}]
[null,null,null,null,null,null,null,null,null,null,null,null,null,null,null,null,null,null,null,"Bottom Glass",{"$f":"(BGW_3001*BGH_3001)/144","v":7.3187934027777776E-2},{"$f":"$C$10","v":3.2},0.23420138888888889,null,null,null,{"$error":"#N/A"},{"$error":"#N/A"},{"$f":"IF(AND(AB44=14,$Z$4>=23,$Z$4<=25),AB44&\"F\",0)","v":{"$error":"#N/A"}},null,null,{"$error":"#N/A"},0,{"$f":"IF(AND(AG44=14,$AE$4>=23,$AE$4<=25),AG44&\"F\",0)","v":{"$error":"#N/A"}}]
[null,null,null,null,null,null,null,null,null,null,null,null,null,null,null,null,null,null,null,"Bottom Spacer",{"$f":"((BGW_3001*2)+(BGH_3001*2))/12","v":-1.1614583333333333},5.3600000000000002E-2,-6.2254166666666666E-2,null,null,null,{"$error":"#N/A"},{"$error":"#N/A"},{"$f":"IF(AND(AB45=14,$Z$4>=26,$Z$4<=28),AB45&\"G\",0)","v":{"$error":"#N/A"}},null,null,{"$error":"#N/A"},0,{"$f":"IF(AND(AG45=14,$AE$4>=26,$AE$4<=28),AG45&\"G\",0)","v":{"$error":"#N/A"}}]
[null,null,null,null,null,null,null,null,null,null,null,null,null,null,null,null,null,null,null,"Bottom Hardware",1,0.36,0.36,null,null,null,{"$error":"#N/A"},{"$error":"#N/A"},{"$f":"IF(AND(AB46=14,$Z$4>=29,$Z$4<=31),AB46&\"H\",0)","v":{"$error":"#N/A"}},null,null,{"$error":"#N/A"},0,{"$f":"IF(AND(AG46=14,$AE$4>=29,$AE$4<=31),AG46&\"H\",0)","v":{"$error":"#N/A"}}]
[null,null,null,null,null,null,null,null,null,null,null,null,null,null,null,null,null,null,null,"Bottom Bead",{"$f":"(((Frame_Width-4.125)*2)+((CDIM3001-3.3125)*2))/12","v":-1.2395833333333333},7.1999999999999995E-2,-8.9249999999999982E-2,null,null,null,{"$error":"#N/A"},{"$error":"#N/A"},{"$f":"IF(AND(AB47=14,$Z$4>=32,$Z$4<=34),AB47&\"I\",0)","v":{"$error":"#N/A"}},null,null,{"$error":"#N/A"},0,{"$f":"IF(AND(AG47=14,$AE$4>=32,$AE$4<=34),AG47&\"I\",0)","v":{"$error":"#N/A"}}]
[null,null,null,null,null,null,null,null,null,null,null,null,null,null,null,null,null,null,null,null,null,null,{"$f":"IF(ModelNo=\"3001\",TRUNC((SUM(W30:W38))),0)","v":0},null,null,null,{"$error":"#N/A"},{"$error":"#N/A"},{"$f":"IF(AND(AB48=14,$Z$4>=35,$Z$4<=38,ModelNo=\"9001\"),\"Dbl.\"&AB48&\"D\",0)","v":{"$error":"#N/A"}},null,null,{"$error":"#N/A"},0,{"$f":"IF(AND(AG48=14,$AE$4>=35,$AE$4<=38,ModelNo=\"9001\"),\"Dbl.\"&AG48&\"D\",0)","v":{"$error":"#N/A"}}]
[null,null,null,null,null,null,null,null,null,null,null,null,null,null,null,null,null,null,null,null,null,null,{"$f":"IF(ModelNo=\"3001\",TRUNC((SUM(W39:W47))),0)","v":0},null,null,null,{"$error":"#N/A"},{"$error":"#N/A"},{"$f":"IF(AND(AB49=14,$Z$4>=39,$Z$4<=44,ModelNo=\"9001\"),\"Dbl.\"&AB49&\"E\",0)","v":{"$error":"#N/A"}},null,null,{"$error":"#N/A"},0,{"$f":"IF(AND(AG49=14,$AE$4>=39,$AE$4<=44,ModelNo=\"9001\"),\"Dbl.\"&AG49&\"E\",0)","v":{"$error":"#N/A"}}]
[null,null,null,null,null,null,null,null,null,null,null,null,null,null,null,null,null,null,null,null,null,null,null,null,null,null,{"$error":"#N/A"},{"$error":"#N/A"},{"$f":"IF(AND(AB50=14,$Z$4>=45,$Z$4<=50,ModelNo=\"9001\"),\"Dbl.\"&AB50&\"F\",0)","v":{"$error":"#N/A"}},null,null,{"$error":"#N/A"},0,{"$f":"IF(AND(AG50=14,$AE$4>=45,$AE$4<=50,ModelNo=\"9001\"),\"Dbl.\"&AG50&\"F\",0)","v":{"$error":"#N/A"}}]
[null,null,null,null,null,null,null,null,null,null,null,null,null,null,null,null,null,null,null,null,null,null,null,null,null,null,{"$error":"#N/A"},{"$error":"#N/A"},{"$f":"IF(AND(AB51=14,$Z$4>=51,$Z$4<=56,ModelNo=\"9001\"),\"Dbl.\"&AB51&\"G\",0)","v":{"$error":"#N/A"}},null,null,{"$error":"#N/A"},0,{"$f":"IF(AND(AG51=14,$AE$4>=51,$AE$4<=56,ModelNo=\"9001\"),\"Dbl.\"&AG51&\"G\",0)","v":{"$error":"#N/A"}}]
[null,null,null,null,null,null,null,false,null,null,null,null,null,null,null,null,null,null,null,null,null,null,null,null,null,null,{"$error":"#N/A"},{"$error":"#N/A"},{"$f":"IF(AND(AB52=14,$Z$4>=57,$Z$4<=62,ModelNo=\"9001\"),\"Dbl.\"&AB52&\"H\",0)","v":{"$error":"#N/A"}},null,null,{"$error":"#N/A"},0,{"$f":"IF(AND(AG52=14,$AE$4>=57,$AE$4<=62,ModelNo=\"9001\"),\"Dbl.\"&AG52&\"H\",0)","v":{"$error":"#N/A"}}]
[null,null,null,null,null,null,null,"Model","Head","Sill","Center of Astragal","Top Sash Width","Sash Height",null,null,null,null,null,null,null,null,null,null,null,null,null,{"$error":"#N/A"},{"$error":"#N/A"},{"$f":"IF(AND(AB53=14,$Z$4>=63,$Z$4<=68,ModelNo=\"9001\"),\"Dbl.\"&AB53&\"I\",0)","v":{"$error":"#N/A"}},null,null,{"$error":"#N/A"},0,{"$f":"IF(AND(AG53=14,$AE$4>=63,$AE$4<=68,ModelNo=\"9001\"),\"Dbl.\"&AG53&\"I\",0)","v":{"$error":"#N/A"}}]
[null,null,null,null,null,null,null,{"$f":"ModelNo","v":"Select a Model"},{"$f":"IF(ISERROR(VLOOKUP(ModelNo,ACTABLE,2,FALSE)),\"\",VLOOKUP(ModelNo,ACTABLE,2,FALSE))","v":""},{"$f":"IF(ISERROR(VLOOKUP(ModelNo,ACTABLE,3,FALSE)),\"\",VLOOKUP(ModelNo,ACTABLE,3,FALSE))","v":""},{"$f":"IF(ISERROR(VLOOKUP(ModelNo,ACTABLE,4,FALSE)),\"\",VLOOKUP(ModelNo,ACTABLE,4,FALSE))","v":""},{"$f":"IF(ISERROR(VLOOKUP(ModelNo,ACTABLE,5,FALSE)),\"\",VLOOKUP(ModelNo,ACTABLE,5,FALSE))","v":""},{"$f":"IF(ISERROR(VLOOKUP(ModelNo,ACTABLE,6,FALSE)),\"\",VLOOKUP(ModelNo,ACTABLE,6,FALSE))","v":""},null,null,null,null,null,null,null,null,null,null,null,null,null,{"$error":"#N/A"},{"$f":"IF(AND($AA$4<=16,$AA$4>14),16,0)","v":{"$error":"#N/A"}},{"$f":"IF(AND(AB54=16,$Z$4>=3,$Z$4<=7),AB54&\"A\",0)","v":{"$error":"#N/A"}},null,null,{"$error":"#N/A"},{"$f":"IF(AND($AF$4<=16,$AF$4>14),16,0)","v":0},{"$f":"IF(AND(AG54=16,$AE$4>=3,$AE$4<=7),AG54&\"A\",0)","v":{"$error":"#N/A"}}]
[null,null,null,null,null,null,null,"9001",2.5,2.75,null,{"$f":"Frame_Width-4.9375","v":-4.9375},{"$f":"INT((Frame_Height-(I55+J55+0.5+ACHEIGHT))*16+0.5)/16","v":-5.75},null,null,null,null,null,null,null,null,null,null,null,null,null,{"$error":"#N/A"},{"$error":"#N/A"},{"$f":"IF(AND(AB55=16,$Z$4>=8,$Z$4<=10),AB55&\"B\",0)","v":{"$error":"#N/A"}},null,null,{"$error":"#N/A"},0,{"$f":"IF(AND(AG55=16,$AE$4>=8,$AE$4<=10),AG55&\"B\",0)","v":{"$error":"#N/A"}}]
[null,null,null,null,null,null,null,"P601",2.5,2.75,null,{"$f":"Frame_Width-4.9375","v":-4.9375},{"$f":"INT((Frame_Height-(I56+J56+0.5+ACHEIGHT))*16+0.5)/16","v":-5.75},null,null,null,null,null,null,null,null,null,null,null,null,null,{"$error":"#N/A"},{"$error":"#N/A"},{"$f":"IF(AND(AB56=16,$Z$4>=11,$Z$4<=16),AB56&\"C\",0)","v":{"$error":"#N/A"}},null,null,{"$error":"#N/A"},0,{"$f":"IF(AND(AG56=16,$AE$4>=11,$AE$4<=16),AG56&\"C\",0)","v":{"$error":"#N/A"}}]
[null,null,null,null,null,null,null,"3001","2.0625",1.875,null,{"$f":"Frame_Width-4.125","v":-4.125},{"$f":"INT((Frame_Height-(I57+J57+0.5+ACHEIGHT))*16+0.5)/16","v":-4.4375},null,null,null,null,null,null,null,null,null,null,null,null,null,{"$error":"#N/A"},{"$error":"#N/A"},{"$f":"IF(AND(AB57=16,$Z$4>=17,$Z$4<=19),AB57&\"D\",0)","v":{"$error":"#N/A"}},null,null,{"$error":"#N/A"},0,{"$f":"IF(AND(AG57=16,$AE$4>=17,$AE$4<=19),AG57&\"D\",0)","v":{"$error":"#N/A"}}]
[null,null,null,null,null,null,null,null,null,null,null,null,null,null,null,null,null,null,null,null,null,null,null,null,null,null,{"$error":"#N/A"},{"$error":"#N/A"},{"$f":"IF(AND(AB58=16,$Z$4>=20,$Z$4<=22),AB58&\"E\",0)","v":{"$error":"#N/A"}},null,null,{"$error":"#N/A"},0,{"$f":"IF(AND(AG58=16,$AE$4>=20,$AE$4<=22),AG58&\"E\",0)","v":{"$error":"#N/A"}}]
[null,null,null,null,null,null,null,null,null,null,null,null,null,null,null,null,null,null,null,null,null,null,null,null,null,null,{"$error":"#N/A"},{"$error":"#N/A"},{"$f":"IF(AND(AB59=16,$Z$4>=23,$Z$4<=24),AB59&\"F\",0)","v":{"$error":"#N/A"}},null,null,{"$error":"#N/A"},0,{"$f":"IF(AND(AG59=16,$AE$4>=23,$AE$4<=24),AG59&\"F\",0)","v":{"$error":"#N/A"}}]
[null,null,null,null,null,null,null,1,2,3,4,5,null,null,null,null,null,null,null,null,null,null,null,null,null,null,{"$error":"#N/A"},{"$error":"#N/A"},{"$f":"IF(AND(AB60=16,$Z$4>=25,$Z$4<=28),AB60&\"G\",0)","v":{"$error":"#N/A"}},null,null,{"$error":"#N/A"},0,{"$f":"IF(AND(AG60=16,$AE$4>=25,$AE$4<=28),AG60&\"G\",0)","v":{"$error":"#N/A"}}]
[null,null,null,null,null,null,null,"Standard","EnergyMaxx-4","EnergyMaxx-SC","EnergyMaxx-7","EnergyMaxx-10",null,null,null,null,null,null,null,null,null,null,null,null,null,null,{"$error":"#N/A"},{"$error":"#N/A"},{"$f":"IF(AND(AB61=16,$Z$4>=29,$Z$4<=31),AB61&\"H\",0)","v":{"$error":"#N/A"}},null,null,{"$error":"#N/A"},0,{"$f":"IF(AND(AG61=16,$AE$4>=29,$AE$4<=31),AG61&\"H\",0)","v":{"$error":"#N/A"}}]
[null,null,null,null,null,null,"Outside Pane","Clear","SB60","SB60","SB60","SB60",{"$f":"HLOOKUP(Package_Select,$H$60:$L$71,3,FALSE)","v":"Clear"},null,null,null,null,null,null,null,null,null,null,null,null,null,{"$error":"#N/A"},{"$error":"#N/A"},{"$f":"IF(AND(AB62=16,$Z$4>=32,$Z$4<=34),AB62&\"I\",0)","v":{"$error":"#N/A"}},null,null,{"$error":"#N/A"},0,{"$f":"IF(AND(AG62=16,$AE$4>=32,$AE$4<=34),AG62&\"I\",0)","v":{"$error":"#N/A"}}]
[null,null,null,null,null,null,"Middle Pane","N/A","N/A","N/A","Clear","Clear",{"$f":"HLOOKUP(Package_Select,$H$60:$L$71,4,FALSE)","v":"N/A"},null,null,null,null,null,null,null,null,null,null,null,null,null,{"$error":"#N/A"},{"$error":"#N/A"},{"$f":"IF(AND(AB63=16,$Z$4>=35,$Z$4<=36,ModelNo=\"9001\"),\"Dbl.\"&AB63&\"D\",0)","v":{"$error":"#N/A"}},null,null,{"$error":"#N/A"},0,{"$f":"IF(AND(AG63=16,$AE$4>=35,$AE$4<=36,ModelNo=\"9001\"),\"Dbl.\"&AG63&\"D\",0)","v":{"$error":"#N/A"}}]
[null,null,null,null,null,null,"Inside Pane","Clear","Clear","SB60","SB60","SB60",{"$f":"HLOOKUP(Package_Select,$H$60:$L$71,5,FALSE)","v":"Clear"},null,null,null,null,null,null,null,null,null,null,null,null,null,{"$error":"#N/A"},{"$error":"#N/A"},{"$f":"IF(AND(AB64=16,$Z$4>=37,$Z$4<=44,ModelNo=\"9001\"),\"Dbl.\"&AB64&\"E\",0)","v":{"$error":"#N/A"}},null,null,{"$error":"#N/A"},0,{"$f":"IF(AND(AG64=16,$AE$4>=37,$AE$4<=44,ModelNo=\"9001\"),\"Dbl.\"&AG64&\"E\",0)","v":{"$error":"#N/A"}}]
[null,null,null,null,null,null,"Spacer","SST","SST","SST","SST","SST",{"$f":"HLOOKUP(Package_Select,$H$60:$L$71,6,FALSE)","v":"SST"},null,null,null,null,null,null,null,null,null,null,null,null,null,{"$error":"#N/A"},{"$error":"#N/A"},{"$f":"IF(AND(AB65=16,$Z$4>=45,$Z$4<=48,ModelNo=\"9001\"),\"Dbl.\"&AB65&\"F\",0)","v":{"$error":"#N/A"}},null,null,{"$error":"#N/A"},0,{"$f":"IF(AND(AG65=16,$AE$4>=45,$AE$4<=48,ModelNo=\"9001\"),\"Dbl.\"&AG65&\"F\",0)","v":{"$error":"#N/A"}}]
[null,null,null,null,null,null,"Gas","Air","Argon","Argon","Argon","Krypton",{"$f":"HLOOKUP(Package_Select,$H$60:$L$71,7,FALSE)","v":"Air"},null,null,null,null,null,null,null,null,null,null,null,null,null,{"$error":"#N/A"},{"$error":"#N/A"},{"$f":"IF(AND(AB66=16,$Z$4>=49,$Z$4<=56,ModelNo=\"9001\"),\"Dbl.\"&AB66&\"G\",0)","v":{"$error":"#N/A"}},null,null,{"$error":"#N/A"},0,{"$f":"IF(AND(AG66=16,$AE$4>=49,$AE$4<=56,ModelNo=\"9001\"),\"Dbl.\"&AG66&\"G\",0)","v":{"$error":"#N/A"}}]
[null,null,null,null,null,null,"R-Value",2,3.85,4,6.67,10,{"$f":"HLOOKUP(Package_Select,$H$60:$L$71,8,FALSE)","v":2},null,null,null,null,null,null,null,null,null,null,null,null,null,{"$error":"#N/A"},{"$error":"#N/A"},{"$f":"IF(AND(AB67=16,$Z$4>=57,$Z$4<=62,ModelNo=\"9001\"),\"Dbl.\"&AB67&\"H\",0)","v":{"$error":"#N/A"}},null,null,{"$error":"#N/A"},0,{"$f":"IF(AND(AG67=16,$AE$4>=57,$AE$4<=62,ModelNo=\"9001\"),\"Dbl.\"&AG67&\"H\",0)","v":{"$error":"#N/A"}}]
[null,null,null,null,null,null,"U-Value",0.5,0.26,0.25,0.15,0.1,{"$f":"HLOOKUP(Package_Select,$H$60:$L$71,9,FALSE)","v":0.5},null,null,null,null,null,null,null,null,null,null,null,null,null,{"$error":"#N/A"},{"$error":"#N/A"},{"$f":"IF(AND(AB68=16,$Z$4>=63,$Z$4<=68,ModelNo=\"9001\"),\"Dbl.\"&AB68&\"I\",0)","v":{"$error":"#N/A"}},null,null,{"$error":"#N/A"},0,{"$f":"IF(AND(AG68=16,$AE$4>=63,$AE$4<=68,ModelNo=\"9001\"),\"Dbl.\"&AG68&\"I\",0)","v":{"$error":"#N/A"}}]
[null,null,null,null,null,null,"Visible Light Transmit.",0.82,0.72,0.62,0.56999999999999995,0.56999999999999995,{"$f":"HLOOKUP(Package_Select,$H$60:$L$71,10,FALSE)","v":0.82},null,null,null,null,null,null,null,null,null,null,null,null,null,{"$f":"IF(AND(AB69>0,AC69>0),AB69,0)","v":{"$error":"#N/A"}},{"$f":"IF(AND($AA$4<=18,$AA$4>16),18,0)","v":{"$error":"#N/A"}},{"$f":"IF(AND(AB69=18,$Z$4>=4,$Z$4<=9),AB69&\"A\",0)","v":{"$error":"#N/A"}},null,null,{"$f":"IF(AND(AG69>0,AH69>0),AG69,0)","v":{"$error":"#N/A"}},{"$f":"IF(AND($AF$4<=18,$AF$4>16),18,0)","v":0},{"$f":"IF(AND(AG69=18,$AE$4>=4,$AE$4<=9),AG69&\"A\",0)","v":{"$error":"#N/A"}}]
[null,null,null,null,null,null,"UV Light Transmit.",0.63,0.16,0.05,0.05,0.05,{"$f":"HLOOKUP(Package_Select,$H$60:$L$71,11,FALSE)","v":0.63},null,null,null,null,null,null,null,null,null,null,null,null,null,{"$error":"#N/A"},{"$error":"#N/A"},{"$f":"IF(AND(AB70=18,$Z$4>=10,$Z$4<=13),AB70&\"B\",0)","v":{"$error":"#N/A"}},null,null,{"$error":"#N/A"},0,{"$f":"IF(AND(AG70=18,$AE$4>=10,$AE$4<=13),AG70&\"B\",0)","v":{"$error":"#N/A"}}]
[null,null,null,null,null,null,"Solar Heat Gain",0.78,0.39,0.36,0.33,0.33,{"$f":"HLOOKUP(Package_Select,$H$60:$L$71,12,FALSE)","v":0.78},null,null,null,null,null,null,null,null,null,null,null,null,null,{"$error":"#N/A"},{"$error":"#N/A"},{"$f":"IF(AND(AB71=18,$Z$4>=14,$Z$4<=18),AB71&\"C\",0)","v":{"$error":"#N/A"}},null,null,{"$error":"#N/A"},0,{"$f":"IF(AND(AG71=18,$AE$4>=14,$AE$4<=18),AG71&\"C\",0)","v":{"$error":"#N/A"}}]
[null,null,null,null,null,null,null,null,null,null,null,null,null,null,null,null,null,null,null,null,null,null,null,null,null,null,{"$error":"#N/A"},{"$error":"#N/A"},{"$f":"IF(AND(AB72=18,$Z$4>=19,$Z$4<=21),AB72&\"D\",0)","v":{"$error":"#N/A"}},null,null,{"$error":"#N/A"},0,{"$f":"IF(AND(AG72=18,$AE$4>=19,$AE$4<=21),AG72&\"D\",0)","v":{"$error":"#N/A"}}]
[null,null,null,null,null,null,null,null,"Standard",null,null,null,null,null,null,null,null,null,null,null,null,null,null,null,null,null,{"$error":"#N/A"},{"$error":"#N/A"},{"$f":"IF(AND(AB73=18,$Z$4>=22,$Z$4<=24),AB73&\"E\",0)","v":{"$error":"#N/A"}},null,null,{"$error":"#N/A"},0,{"$f":"IF(AND(AG73=18,$AE$4>=22,$AE$4<=24),AG73&\"E\",0)","v":{"$error":"#N/A"}}]
[null,null,null,null,null,null,null,null,"EnergyMaxx-4",null,null,null,null,null,null,null,null,null,null,null,null,null,null,null,null,null,{"$error":"#N/A"},{"$error":"#N/A"},{"$f":"IF(AND(AB74=18,$Z$4>=25,$Z$4<=26),AB74&\"F\",0)","v":{"$error":"#N/A"}},null,null,{"$error":"#N/A"},0,{"$f":"IF(AND(AG74=18,$AE$4>=25,$AE$4<=26),AG74&\"F\",0)","v":{"$error":"#N/A"}}]
[null,null,null,null,null,null,null,null,"EnergyMaxxSC",null,null,null,null,null,null,null,null,null,null,null,null,null,null,null,null,null,{"$error":"#N/A"},{"$error":"#N/A"},{"$f":"IF(AND(AB75=18,$Z$4>=27,$Z$4<=29),AB75&\"G\",0)","v":{"$error":"#N/A"}},null,null,{"$error":"#N/A"},0,{"$f":"IF(AND(AG75=18,$AE$4>=27,$AE$4<=29),AG75&\"G\",0)","v":{"$error":"#N/A"}}]
[null,null,null,null,null,null,null,null,"EnergyMaxx7",null,null,null,null,null,null,null,null,null,null,null,null,null,null,null,null,null,{"$error":"#N/A"},{"$error":"#N/A"},{"$f":"IF(AND(AB76=18,$Z$4>=30,$Z$4<=32),AB76&\"H\",0)","v":{"$error":"#N/A"}},null,null,{"$error":"#N/A"},0,{"$f":"IF(AND(AG76=18,$AE$4>=30,$AE$4<=32),AG76&\"H\",0)","v":{"$error":"#N/A"}}]
[null,null,null,null,null,null,null,null,"EnergyMaxx-10",null,null,null,null,null,null,null,null,null,null,null,null,null,null,null,null,null,{"$error":"#N/A"},{"$error":"#N/A"},{"$f":"IF(AND(AB77=18,$Z$4>=33,$Z$4<=34),AB77&\"I\",0)","v":{"$error":"#N/A"}},null,null,{"$error":"#N/A"},0,{"$f":"IF(AND(AG77=18,$AE$4>=33,$AE$4<=34),AG77&\"I\",0)","v":{"$error":"#N/A"}}]
[null,null,null,null,null,null,null,null,1,null,null,null,null,null,null,null,null,null,null,null,null,null,null,null,null,null,{"$error":"#N/A"},{"$error":"#N/A"},{"$f":"IF(AND(AB78=18,$Z$4>=35,$Z$4<=36,ModelNo=\"9001\"),\"Dbl.\"&AB78&\"C\",0)","v":{"$error":"#N/A"}},null,null,{"$error":"#N/A"},0,{"$f":"IF(AND(AG78=18,$AE$4>=35,$AE$4<=36,ModelNo=\"9001\"),\"Dbl.\"&AG78&\"C\",0)","v":{"$error":"#N/A"}}]
[null,null,null,null,null,null,null,null,null,null,null,null,null,null,null,null,null,null,null,null,null,null,null,null,null,null,{"$error":"#N/A"},{"$error":"#N/A"},{"$f":"IF(AND(AB79=18,$Z$4>=37,$Z$4<=42,ModelNo=\"9001\"),\"Dbl.\"&AB79&\"D\",0)","v":{"$error":"#N/A"}},null,null,{"$error":"#N/A"},0,{"$f":"IF(AND(AG79=18,$AE$4>=37,$AE$4<=42,ModelNo=\"9001\"),\"Dbl.\"&AG79&\"D\",0)","v":{"$error":"#N/A"}}]
[null,null,null,null,null,null,null,null,null,null,null,null,null,null,null,null,null,null,null,null,null,null,null,null,null,null,{"$error":"#N/A"},{"$error":"#N/A"},{"$f":"IF(AND(AB80=18,$Z$4>=43,$Z$4<=48,ModelNo=\"9001\"),\"Dbl.\"&AB80&\"E\",0)","v":{"$error":"#N/A"}},null,null,{"$error":"#N/A"},0,{"$f":"IF(AND(AG80=18,$AE$4>=43,$AE$4<=48,ModelNo=\"9001\"),\"Dbl.\"&AG80&\"E\",0)","v":{"$error":"#N/A"}}]
[null,null,null,null,null,null,null,null,null,null,null,null,null,null,null,null,null,null,null,null,null,null,null,null,null,null,{"$error":"#N/A"},{"$error":"#N/A"},{"$f":"IF(AND(AB81=18,$Z$4>=49,$Z$4<=52,ModelNo=\"9001\"),\"Dbl.\"&AB81&\"F\",0)","v":{"$error":"#N/A"}},null,null,{"$error":"#N/A"},0,{"$f":"IF(AND(AG81=18,$AE$4>=49,$AE$4<=52,ModelNo=\"9001\"),\"Dbl.\"&AG81&\"F\",0)","v":{"$error":"#N/A"}}]
[null,null,null,null,null,null,null,null,null,null,null,null,null,null,null,null,null,null,null,null,null,null,null,null,null,null,{"$error":"#N/A"},{"$error":"#N/A"},{"$f":"IF(AND(AB82=18,$Z$4>=53,$Z$4<=58,ModelNo=\"9001\"),\"Dbl.\"&AB82&\"G\",0)","v":{"$error":"#N/A"}},null,null,{"$error":"#N/A"},0,{"$f":"IF(AND(AG82=18,$AE$4>=53,$AE$4<=58,ModelNo=\"9001\"),\"Dbl.\"&AG82&\"G\",0)","v":{"$error":"#N/A"}}]
[null,null,null,null,null,null,null,null,null,null,null,null,null,null,null,null,null,null,null,null,null,null,null,null,null,null,{"$error":"#N/A"},{"$error":"#N/A"},{"$f":"IF(AND(AB83=18,$Z$4>=59,$Z$4<=64,ModelNo=\"9001\"),\"Dbl.\"&AB83&\"H\",0)","v":{"$error":"#N/A"}},null,null,{"$error":"#N/A"},0,{"$f":"IF(AND(AG83=18,$AE$4>=59,$AE$4<=64,ModelNo=\"9001\"),\"Dbl.\"&AG83&\"H\",0)","v":{"$error":"#N/A"}}]
[null,null,null,null,null,null,null,null,null,null,null,null,null,null,null,null,null,null,null,null,null,null,null,null,null,null,{"$error":"#N/A"},{"$error":"#N/A"},{"$f":"IF(AND(AB84=18,$Z$4>=65,$Z$4<=68,ModelNo=\"9001\"),\"Dbl.\"&AB84&\"I\",0)","v":{"$error":"#N/A"}},null,null,{"$error":"#N/A"},0,{"$f":"IF(AND(AG84=18,$AE$4>=65,$AE$4<=68,ModelNo=\"9001\"),\"Dbl.\"&AG84&\"I\",0)","v":{"$error":"#N/A"}}]
[null,null,null,null,null,null,null,null,null,null,null,null,null,null,null,null,null,null,null,null,null,null,null,null,null,null,{"$error":"#N/A"},{"$f":"IF(AND($AA$4<=20,$AA$4>18),20,0)","v":{"$error":"#N/A"}},{"$f":"IF(AND(AB85=20,$Z$4>=5,$Z$4<=10),AB85&\"A\",0)","v":{"$error":"#N/A"}},null,null,{"$error":"#N/A"},{"$f":"IF(AND($AF$4<=20,$AF$4>18),20,0)","v":0},{"$f":"IF(AND(AG85=20,$AE$4>=5,$AE$4<=10),AG85&\"A\",0)","v":{"$error":"#N/A"}}]
[null,null,null,null,null,null,null,null,null,null,null,null,null,null,null,null,null,null,null,null,null,null,null,null,null,null,{"$error":"#N/A"},{"$error":"#N/A"},{"$f":"IF(AND(AB86=20,$Z$4>=11,$Z$4<=14),AB86&\"B\",0)","v":{"$error":"#N/A"}},null,null,{"$error":"#N/A"},0,{"$f":"IF(AND(AG86=20,$AE$4>=11,$AE$4<=14),AG86&\"B\",0)","v":{"$error":"#N/A"}}]
[null,null,null,null,null,null,null,null,null,null,null,null,null,null,null,null,null,null,null,null,null,null,null,null,null,null,{"$error":"#N/A"},{"$error":"#N/A"},{"$f":"IF(AND(AB87=20,$Z$4>=15,$Z$4<=18),AB87&\"C\",0)","v":{"$error":"#N/A"}},null,null,{"$error":"#N/A"},0,{"$f":"IF(AND(AG87=20,$AE$4>=15,$AE$4<=18),AG87&\"C\",0)","v":{"$error":"#N/A"}}]
[null,null,null,null,null,null,null,null,null,null,null,null,null,null,null,null,null,null,null,null,null,null,null,null,null,null,{"$error":"#N/A"},{"$error":"#N/A"},{"$f":"IF(AND(AB88=20,$Z$4>=19,$Z$4<=22),AB88&\"D\",0)","v":{"$error":"#N/A"}},null,null,{"$error":"#N/A"},0,{"$f":"IF(AND(AG88=20,$AE$4>=19,$AE$4<=22),AG88&\"D\",0)","v":{"$error":"#N/A"}}]
[null,null,null,null,null,null,null,null,null,null,null,null,null,null,null,null,null,null,null,null,null,null,null,null,null,null,{"$error":"#N/A"},{"$error":"#N/A"},{"$f":"IF(AND(AB89=20,$Z$4>=23,$Z$4<=26),AB89&\"E\",0)","v":{"$error":"#N/A"}},null,null,{"$error":"#N/A"},0,{"$f":"IF(AND(AG89=20,$AE$4>=23,$AE$4<=26),AG89&\"E\",0)","v":{"$error":"#N/A"}}]
[null,null,null,null,null,null,null,null,null,null,null,null,null,null,null,null,null,null,null,null,null,null,null,null,null,null,{"$error":"#N/A"},{"$error":"#N/A"},{"$f":"IF(AND(AB90=20,$Z$4>=27,$Z$4<=30),AB90&\"F\",0)","v":{"$error":"#N/A"}},null,null,{"$error":"#N/A"},0,{"$f":"IF(AND(AG90=20,$AE$4>=27,$AE$4<=30),AG90&\"F\",0)","v":{"$error":"#N/A"}}]
[null,null,null,null,null,null,null,null,null,null,null,null,null,null,null,null,null,null,null,null,null,null,null,null,null,null,{"$error":"#N/A"},{"$error":"#N/A"},{"$f":"IF(AND(AB91=20,$Z$4>=31,$Z$4<=34),AB91&\"G\",0)","v":{"$error":"#N/A"}},null,null,{"$error":"#N/A"},0,{"$f":"IF(AND(AG91=20,$AE$4>=31,$AE$4<=34),AG91&\"G\",0)","v":{"$error":"#N/A"}}]
[null,null,null,null,null,null,null,null,null,null,null,null,null,null,null,null,null,null,null,null,null,null,null,null,null,null,{"$error":"#N/A"},{"$error":"#N/A"},{"$f":"IF(AND(AB92=20,$Z$4>=35,$Z$4<=37),AB92&\"H\",0)","v":{"$error":"#N/A"}},null,null,{"$error":"#N/A"},0,{"$f":"IF(AND(AG92=20,$AE$4>=35,$AE$4<=37),AG92&\"H\",0)","v":{"$error":"#N/A"}}]
[null,null,null,null,null,null,null,null,null,null,null,null,null,null,null,null,null,null,null,null,null,null,null,null,null,null,{"$error":"#N/A"},{"$error":"#N/A"},{"$f":"IF(AND(AB93=20,$Z$4>=38,$Z$4<=40),AB93&\"I\",0)","v":{"$error":"#N/A"}},null,null,{"$error":"#N/A"},0,{"$f":"IF(AND(AG93=20,$AE$4>=38,$AE$4<=40),AG93&\"I\",0)","v":{"$error":"#N/A"}}]
[null,null,null,null,null,null,null,null,null,null,null,null,null,null,null,null,null,null,null,null,null,null,null,null,null,null,{"$error":"#N/A"},{"$error":"#N/A"},{"$f":"IF(AND(AB94=20,$Z$4>=41,$Z$4<=44,ModelNo=\"9001\"),\"Dbl.\"&AB94&\"D\",0)","v":{"$error":"#N/A"}},null,null,{"$error":"#N/A"},0,{"$f":"IF(AND(AG94=20,$AE$4>=41,$AE$4<=44,ModelNo=\"9001\"),\"Dbl.\"&AG94&\"D\",0)","v":{"$error":"#N/A"}}]
[null,null,null,null,null,null,null,null,null,null,null,null,null,null,null,null,null,null,null,null,null,null,null,null,null,null,{"$error":"#N/A"},{"$error":"#N/A"},{"$f":"IF(AND(AB95=20,$Z$4>=45,$Z$4<=52,ModelNo=\"9001\"),\"Dbl.\"&AB95&\"E\",0)","v":{"$error":"#N/A"}},null,null,{"$error":"#N/A"},0,{"$f":"IF(AND(AG95=20,$AE$4>=45,$AE$4<=52,ModelNo=\"9001\"),\"Dbl.\"&AG95&\"E\",0)","v":{"$error":"#N/A"}}]
[null,null,null,null,null,null,null,null,null,null,null,null,null,null,null,null,null,null,null,null,null,null,null,null,null,null,{"$error":"#N/A"},{"$error":"#N/A"},{"$f":"IF(AND(AB96=20,$Z$4>=53,$Z$4<=60,ModelNo=\"9001\"),\"Dbl.\"&AB96&\"F\",0)","v":{"$error":"#N/A"}},null,null,{"$error":"#N/A"},0,{"$f":"IF(AND(AG96=20,$AE$4>=53,$AE$4<=60,ModelNo=\"9001\"),\"Dbl.\"&AG96&\"F\",0)","v":{"$error":"#N/A"}}]
[null,null,null,null,null,null,null,null,null,null,null,null,null,null,null,null,null,null,null,null,null,null,null,null,null,null,{"$error":"#N/A"},{"$error":"#N/A"},{"$f":"IF(AND(AB97=20,$Z$4>=61,$Z$4<=68,ModelNo=\"9001\"),\"Dbl.\"&AB97&\"G\",0)","v":{"$error":"#N/A"}},null,null,{"$error":"#N/A"},0,{"$f":"IF(AND(AG97=20,$AE$4>=61,$AE$4<=68,ModelNo=\"9001\"),\"Dbl.\"&AG97&\"G\",0)","v":{"$error":"#N/A"}}]
[null,null,null,null,null,null,null,null,null,null,null,null,null,null,null,null,null,null,null,null,null,null,null,null,null,null,{"$error":"#N/A"},{"$error":"#N/A"},{"$f":"IF(AND(AB98=20,$Z$4>=69,$Z$4<=74,ModelNo=\"9001\"),\"Dbl.\"&AB98&\"H\",0)","v":{"$error":"#N/A"}},null,null,{"$error":"#N/A"},0,{"$f":"IF(AND(AG98=20,$AE$4>=69,$AE$4<=74,ModelNo=\"9001\"),\"Dbl.\"&AG98&\"H\",0)","v":{"$error":"#N/A"}}]
[null,null,null,null,null,null,null,null,null,null,null,null,null,null,null,null,null,null,null,null,null,null,null,null,null,null,{"$error":"#N/A"},{"$error":"#N/A"},{"$f":"IF(AND(AB99=20,$Z$4>=75,$Z$4<=80,ModelNo=\"9001\"),\"Dbl.\"&AB99&\"I\",0)","v":{"$error":"#N/A"}},null,null,{"$error":"#N/A"},0,{"$f":"IF(AND(AG99=20,$AE$4>=75,$AE$4<=80,ModelNo=\"9001\"),\"Dbl.\"&AG99&\"I\",0)","v":{"$error":"#N/A"}}]
[null,null,null,null,null,null,null,null,null,null,null,null,null,null,null,null,null,null,null,null,null,null,null,null,null,null,{"$error":"#N/A"},{"$f":"IF(AND($AA$4<=22,$AA$4>20),22,0)","v":{"$error":"#N/A"}},{"$f":"IF(AND(AB100=22,$Z$4>=5,$Z$4<=10),AB100&\"A\",0)","v":{"$error":"#N/A"}},null,null,{"$error":"#N/A"},{"$f":"IF(AND($AF$4<=22,$AF$4>20),22,0)","v":0},{"$f":"IF(AND(AG100=22,$AE$4>=5,$AE$4<=10),AG100&\"A\",0)","v":{"$error":"#N/A"}}]
[null,null,null,null,null,null,null,null,null,null,null,null,null,null,null,null,null,null,null,null,null,null,null,null,null,null,{"$error":"#N/A"},{"$error":"#N/A"},{"$f":"IF(AND(AB101=22,$Z$4>=11,$Z$4<=16),AB101&\"B\",0)","v":{"$error":"#N/A"}},null,null,{"$error":"#N/A"},0,{"$f":"IF(AND(AG101=22,$AE$4>=11,$AE$4<=16),AG101&\"B\",0)","v":{"$error":"#N/A"}}]
[null,null,null,null,null,null,null,null,null,null,null,null,null,null,null,null,null,null,null,null,null,null,null,null,null,null,{"$error":"#N/A"},{"$error":"#N/A"},{"$f":"IF(AND(AB102=22,$Z$4>=17,$Z$4<=21),AB102&\"C\",0)","v":{"$error":"#N/A"}},null,null,{"$error":"#N/A"},0,{"$f":"IF(AND(AG102=22,$AE$4>=17,$AE$4<=21),AG102&\"C\",0)","v":{"$error":"#N/A"}}]
[null,null,null,null,null,null,null,null,null,null,null,null,null,null,null,null,null,null,null,null,null,null,null,null,null,null,{"$error":"#N/A"},{"$error":"#N/A"},{"$f":"IF(AND(AB103=22,$Z$4>=22,$Z$4<=24),AB103&\"D\",0)","v":{"$error":"#N/A"}},null,null,{"$error":"#N/A"},0,{"$f":"IF(AND(AG103=22,$AE$4>=22,$AE$4<=24),AG103&\"D\",0)","v":{"$error":"#N/A"}}]
[null,null,null,null,null,null,null,null,null,null,null,null,null,null,null,null,null,null,null,null,null,null,null,null,null,null,{"$error":"#N/A"},{"$error":"#N/A"},{"$f":"IF(AND(AB104=22,$Z$4>=25,$Z$4<=27),AB104&\"E\",0)","v":{"$error":"#N/A"}},null,null,{"$error":"#N/A"},0,{"$f":"IF(AND(AG104=22,$AE$4>=25,$AE$4<=27),AG104&\"E\",0)","v":{"$error":"#N/A"}}]
[null,null,null,null,null,null,null,null,null,null,null,null,null,null,null,null,null,null,null,null,null,null,null,null,null,null,{"$error":"#N/A"},{"$error":"#N/A"},{"$f":"IF(AND(AB105=22,$Z$4>=28,$Z$4<=30),AB105&\"F\",0)","v":{"$error":"#N/A"}},null,null,{"$error":"#N/A"},0,{"$f":"IF(AND(AG105=22,$AE$4>=28,$AE$4<=30),AG105&\"F\",0)","v":{"$error":"#N/A"}}]
[null,null,null,null,null,null,null,null,null,null,null,null,null,null,null,null,null,null,null,null,null,null,null,null,null,null,{"$error":"#N/A"},{"$error":"#N/A"},{"$f":"IF(AND(AB106=22,$Z$4>=31,$Z$4<=34),AB106&\"G\",0)","v":{"$error":"#N/A"}},null,null,{"$error":"#N/A"},0,{"$f":"IF(AND(AG106=22,$AE$4>=31,$AE$4<=34),AG106&\"G\",0)","v":{"$error":"#N/A"}}]
[null,null,null,null,null,null,null,null,null,null,null,null,null,null,null,null,null,null,null,null,null,null,null,null,null,null,{"$error":"#N/A"},{"$error":"#N/A"},{"$f":"IF(AND(AB107=22,$Z$4>=35,$Z$4<=37),AB107&\"H\",0)","v":{"$error":"#N/A"}},null,null,{"$error":"#N/A"},0,{"$f":"IF(AND(AG107=22,$AE$4>=35,$AE$4<=37),AG107&\"H\",0)","v":{"$error":"#N/A"}}]
[null,null,null,null,null,null,null,null,null,null,null,null,null,null,null,null,null,null,null,null,null,null,null,null,null,null,{"$error":"#N/A"},{"$error":"#N/A"},{"$f":"IF(AND(AB108=22,$Z$4>=38,$Z$4<=40),AB108&\"I\",0)","v":{"$error":"#N/A"}},null,null,{"$error":"#N/A"},0,{"$f":"IF(AND(AG108=22,$AE$4>=38,$AE$4<=40),AG108&\"I\",0)","v":{"$error":"#N/A"}}]
[null,null,null,null,null,null,null,null,null,null,null,null,null,null,null,null,null,null,null,null,null,null,null,null,null,null,{"$error":"#N/A"},{"$error":"#N/A"},{"$f":"IF(AND(AB109=22,$Z$4>=41,$Z$4<=42,ModelNo=\"9001\"),\"Dbl.\"&AB109&\"C\",0)","v":{"$error":"#N/A"}},null,null,{"$error":"#N/A"},0,{"$f":"IF(AND(AG109=22,$AE$4>=41,$AE$4<=42,ModelNo=\"9001\"),\"Dbl.\"&AG109&\"C\",0)","v":{"$error":"#N/A"}}]
[null,null,null,null,null,null,null,null,null,null,null,null,null,null,null,null,null,null,null,null,null,null,null,null,null,null,{"$error":"#N/A"},{"$error":"#N/A"},{"$f":"IF(AND(AB110=22,$Z$4>=43,$Z$4<=48,ModelNo=\"9001\"),\"Dbl.\"&AB110&\"D\",0)","v":{"$error":"#N/A"}},null,null,{"$error":"#N/A"},0,{"$f":"IF(AND(AG110=22,$AE$4>=43,$AE$4<=48,ModelNo=\"9001\"),\"Dbl.\"&AG110&\"D\",0)","v":{"$error":"#N/A"}}]
[null,null,null,null,null,null,null,null,null,null,null,null,null,null,null,null,null,null,null,null,null,null,null,null,null,null,{"$error":"#N/A"},{"$error":"#N/A"},{"$f":"IF(AND(AB111=22,$Z$4>=49,$Z$4<=54,ModelNo=\"9001\"),\"Dbl.\"&AB111&\"E\",0)","v":{"$error":"#N/A"}},null,null,{"$error":"#N/A"},0,{"$f":"IF(AND(AG111=22,$AE$4>=49,$AE$4<=54,ModelNo=\"9001\"),\"Dbl.\"&AG111&\"E\",0)","v":{"$error":"#N/A"}}]
[null,null,null,null,null,null,null,null,null,null,null,null,null,null,null,null,null,null,null,null,null,null,null,null,null,null,{"$error":"#N/A"},{"$error":"#N/A"},{"$f":"IF(AND(AB112=22,$Z$4>=55,$Z$4<=60,ModelNo=\"9001\"),\"Dbl.\"&AB112&\"F\",0)","v":{"$error":"#N/A"}},null,null,{"$error":"#N/A"},0,{"$f":"IF(AND(AG112=22,$AE$4>=55,$AE$4<=60,ModelNo=\"9001\"),\"Dbl.\"&AG112&\"F\",0)","v":{"$error":"#N/A"}}]
[null,null,null,null,null,null,null,null,null,null,null,null,null,null,null,null,null,null,null,null,null,null,null,null,null,null,{"$error":"#N/A"},{"$error":"#N/A"},{"$f":"IF(AND(AB113=22,$Z$4>=61,$Z$4<=68,ModelNo=\"9001\"),\"Dbl.\"&AB113&\"G\",0)","v":{"$error":"#N/A"}},null,null,{"$error":"#N/A"},0,{"$f":"IF(AND(AG113=22,$AE$4>=61,$AE$4<=68,ModelNo=\"9001\"),\"Dbl.\"&AG113&\"G\",0)","v":{"$error":"#N/A"}}]
[null,null,null,null,null,null,null,null,null,null,null,null,null,null,null,null,null,null,null,null,null,null,null,null,null,null,{"$error":"#N/A"},{"$error":"#N/A"},{"$f":"IF(AND(AB114=22,$Z$4>=69,$Z$4<=74,ModelNo=\"9001\"),\"Dbl.\"&AB114&\"H\",0)","v":{"$error":"#N/A"}},null,null,{"$error":"#N/A"},0,{"$f":"IF(AND(AG114=22,$AE$4>=69,$AE$4<=74,ModelNo=\"9001\"),\"Dbl.\"&AG114&\"H\",0)","v":{"$error":"#N/A"}}]
[null,null,null,null,null,null,null,null,null,null,null,null,null,null,null,null,null,null,null,null,null,null,null,null,null,null,{"$error":"#N/A"},{"$error":"#N/A"},{"$f":"IF(AND(AB115=22,$Z$4>=75,$Z$4<=80,ModelNo=\"9001\"),\"Dbl.\"&AB115&\"I\",0)","v":{"$error":"#N/A"}},null,null,{"$error":"#N/A"},0,{"$f":"IF(AND(AG115=22,$AE$4>=75,$AE$4<=80,ModelNo=\"9001\"),\"Dbl.\"&AG115&\"I\",0)","v":{"$error":"#N/A"}}]
[null,null,null,null,null,null,null,null,null,null,null,null,null,null,null,null,null,null,null,null,null,null,null,null,null,null,{"$error":"#N/A"},{"$f":"IF(AND($AA$4<=24,$AA$4>22),24,0)","v":{"$error":"#N/A"}},{"$f":"IF(AND(AB116=24,$Z$4>=6,$Z$4<=10),AB116&\"A\",0)","v":{"$error":"#N/A"}},null,null,{"$error":"#N/A"},{"$f":"IF(AND($AF$4<=24,$AF$4>22),24,0)","v":0},{"$f":"IF(AND(AG116=24,$AE$4>=6,$AE$4<=10),AG116&\"A\",0)","v":{"$error":"#N/A"}}]
[null,null,null,null,null,null,null,null,null,null,null,null,null,null,null,null,null,null,null,null,null,null,null,null,null,null,{"$error":"#N/A"},{"$error":"#N/A"},{"$f":"IF(AND(AB117=24,$Z$4>=11,$Z$4<=17),AB117&\"B\",0)","v":{"$error":"#N/A"}},null,null,{"$error":"#N/A"},0,{"$f":"IF(AND(AG117=24,$AE$4>=11,$AE$4<=17),AG117&\"B\",0)","v":{"$error":"#N/A"}}]
[null,null,null,null,null,null,null,null,null,null,null,null,null,null,null,null,null,null,null,null,null,null,null,null,null,null,{"$error":"#N/A"},{"$error":"#N/A"},{"$f":"IF(AND(AB118=24,$Z$4>=18,$Z$4<=22),AB118&\"C\",0)","v":{"$error":"#N/A"}},null,null,{"$error":"#N/A"},0,{"$f":"IF(AND(AG118=24,$AE$4>=18,$AE$4<=22),AG118&\"C\",0)","v":{"$error":"#N/A"}}]
[null,null,null,null,null,null,null,null,null,null,null,null,null,null,null,null,null,null,null,null,null,null,null,null,null,null,{"$error":"#N/A"},{"$error":"#N/A"},{"$f":"IF(AND(AB119=24,$Z$4>=23,$Z$4<=25),AB119&\"D\",0)","v":{"$error":"#N/A"}},null,null,{"$error":"#N/A"},0,{"$f":"IF(AND(AG119=24,$AE$4>=23,$AE$4<=25),AG119&\"D\",0)","v":{"$error":"#N/A"}}]
[null,null,null,null,null,null,null,null,null,null,null,null,null,null,null,null,null,null,null,null,null,null,null,null,null,null,{"$error":"#N/A"},{"$error":"#N/A"},{"$f":"IF(AND(AB120=24,$Z$4>=26,$Z$4<=28),AB120&\"E\",0)","v":{"$error":"#N/A"}},null,null,{"$error":"#N/A"},0,{"$f":"IF(AND(AG120=24,$AE$4>=26,$AE$4<=28),AG120&\"E\",0)","v":{"$error":"#N/A"}}]
[null,null,null,null,null,null,null,null,null,null,null,null,null,null,null,null,null,null,null,null,null,null,null,null,null,null,{"$error":"#N/A"},{"$error":"#N/A"},{"$f":"IF(AND(AB121=24,$Z$4>=29,$Z$4<=30),AB121&\"F\",0)","v":{"$error":"#N/A"}},null,null,{"$error":"#N/A"},0,{"$f":"IF(AND(AG121=24,$AE$4>=29,$AE$4<=30),AG121&\"F\",0)","v":{"$error":"#N/A"}}]
[null,null,null,null,null,null,null,null,null,null,null,null,null,null,null,null,null,null,null,null,null,null,null,null,null,null,{"$error":"#N/A"},{"$error":"#N/A"},{"$f":"IF(AND(AB122=24,$Z$4>=31,$Z$4<=34),AB122&\"G\",0)","v":{"$error":"#N/A"}},null,null,{"$error":"#N/A"},0,{"$f":"IF(AND(AG122=24,$AE$4>=31,$AE$4<=34),AG122&\"G\",0)","v":{"$error":"#N/A"}}]
[null,null,null,null,null,null,null,null,null,null,null,null,null,null,null,null,null,null,null,null,null,null,null,null,null,null,{"$error":"#N/A"},{"$error":"#N/A"},{"$f":"IF(AND(AB123=24,$Z$4>=35,$Z$4<=37),AB123&\"H\",0)","v":{"$error":"#N/A"}},null,null,{"$error":"#N/A"},0,{"$f":"IF(AND(AG123=24,$AE$4>=35,$AE$4<=37),AG123&\"H\",0)","v":{"$error":"#N/A"}}]
[null,null,null,null,null,null,null,null,null,null,null,null,null,null,null,null,null,null,null,null,null,null,null,null,null,null,{"$error":"#N/A"},{"$error":"#N/A"},{"$f":"IF(AND(AB124=24,$Z$4>=38,$Z$4<=40),AB124&\"I\",0)","v":{"$error":"#N/A"}},null,null,{"$error":"#N/A"},0,{"$f":"IF(AND(AG124=24,$AE$4>=38,$AE$4<=40),AG124&\"I\",0)","v":{"$error":"#N/A"}}]
[null,null,null,null,null,null,null,null,null,null,null,null,null,null,null,null,null,null,null,null,null,null,null,null,null,null,{"$error":"#N/A"},{"$error":"#N/A"},{"$f":"IF(AND(AB125=24,$Z$4>=41,$Z$4<=44,ModelNo=\"9001\"),\"Dbl.\"&AB125&\"C\",0)","v":{"$error":"#N/A"}},null,null,{"$error":"#N/A"},0,{"$f":"IF(AND(AG125=24,$AE$4>=41,$AE$4<=44,ModelNo=\"9001\"),\"Dbl.\"&AG125&\"C\",0)","v":{"$error":"#N/A"}}]
[null,null,null,null,null,null,null,null,null,null,null,null,null,null,null,null,null,null,null,null,null,null,null,null,null,null,{"$error":"#N/A"},{"$error":"#N/A"},{"$f":"IF(AND(AB126=24,$Z$4>=45,$Z$4<=50,ModelNo=\"9001\"),\"Dbl.\"&AB126&\"D\",0)","v":{"$error":"#N/A"}},null,null,{"$error":"#N/A"},0,{"$f":"IF(AND(AG126=24,$AE$4>=45,$AE$4<=50,ModelNo=\"9001\"),\"Dbl.\"&AG126&\"D\",0)","v":{"$error":"#N/A"}}]
[null,null,null,null,null,null,null,null,null,null,null,null,null,null,null,null,null,null,null,null,null,null,null,null,null,null,{"$error":"#N/A"},{"$error":"#N/A"},{"$f":"IF(AND(AB127=24,$Z$4>=51,$Z$4<=56,ModelNo=\"9001\"),\"Dbl.\"&AB127&\"E\",0)","v":{"$error":"#N/A"}},null,null,{"$error":"#N/A"},0,{"$f":"IF(AND(AG127=24,$AE$4>=51,$AE$4<=56,ModelNo=\"9001\"),\"Dbl.\"&AG127&\"E\",0)","v":{"$error":"#N/A"}}]
[null,null,null,null,null,null,null,null,null,null,null,null,null,null,null,null,null,null,null,null,null,null,null,null,null,null,{"$error":"#N/A"},{"$error":"#N/A"},{"$f":"IF(AND(AB128=24,$Z$4>=57,$Z$4<=60,ModelNo=\"9001\"),\"Dbl.\"&AB128&\"F\",0)","v":{"$error":"#N/A"}},null,null,{"$error":"#N/A"},0,{"$f":"IF(AND(AG128=24,$AE$4>=57,$AE$4<=60,ModelNo=\"9001\"),\"Dbl.\"&AG128&\"F\",0)","v":{"$error":"#N/A"}}]
[null,null,null,null,null,null,null,null,null,null,null,null,null,null,null,null,null,null,null,null,null,null,null,null,null,null,{"$error":"#N/A"},{"$error":"#N/A"},{"$f":"IF(AND(AB129=24,$Z$4>=61,$Z$4<=68,ModelNo=\"9001\"),\"Dbl.\"&AB129&\"G\",0)","v":{"$error":"#N/A"}},null,null,{"$error":"#N/A"},0,{"$f":"IF(AND(AG129=24,$AE$4>=61,$AE$4<=68,ModelNo=\"9001\"),\"Dbl.\"&AG129&\"G\",0)","v":{"$error":"#N/A"}}]
[null,null,null,null,null,null,null,null,null,null,null,null,null,null,null,null,null,null,null,null,null,null,null,null,null,null,{"$error":"#N/A"},{"$error":"#N/A"},{"$f":"IF(AND(AB130=24,$Z$4>=69,$Z$4<=74,ModelNo=\"9001\"),\"Dbl.\"&AB130&\"H\",0)","v":{"$error":"#N/A"}},null,null,{"$error":"#N/A"},0,{"$f":"IF(AND(AG130=24,$AE$4>=69,$AE$4<=74,ModelNo=\"9001\"),\"Dbl.\"&AG130&\"H\",0)","v":{"$error":"#N/A"}}]
[null,null,null,null,null,null,null,null,null,null,null,null,null,null,null,null,null,null,null,null,null,null,null,null,null,null,{"$error":"#N/A"},{"$error":"#N/A"},{"$f":"IF(AND(AB131=24,$Z$4>=75,$Z$4<=80,ModelNo=\"9001\"),\"Dbl.\"&AB131&\"I\",0)","v":{"$error":"#N/A"}},null,null,{"$error":"#N/A"},0,{"$f":"IF(AND(AG131=24,$AE$4>=75,$AE$4<=80,ModelNo=\"9001\"),\"Dbl.\"&AG131&\"I\",0)","v":{"$error":"#N/A"}}]
[null,null,null,null,null,null,null,null,null,null,null,null,null,null,null,null,null,null,null,null,null,null,null,null,null,null,{"$error":"#N/A"},{"$f":"IF(AND($AA$4<=26,$AA$4>24),26,0)","v":{"$error":"#N/A"}},{"$f":"IF(AND(AB132=26,$Z$4>=6,$Z$4<=11),AB132&\"A\",0)","v":{"$error":"#N/A"}},null,null,{"$error":"#N/A"},{"$f":"IF(AND($AF$4<=26,$AF$4>24),26,0)","v":0},{"$f":"IF(AND(AG132=26,$AE$4>=6,$AE$4<=11),AG132&\"A\",0)","v":{"$error":"#N/A"}}]
[null,null,null,null,null,null,null,null,null,null,null,null,null,null,null,null,null,null,null,null,null,null,null,null,null,null,{"$f":"IF(AND(AB133>0,AC133>0),AB133,0)","v":{"$error":"#N/A"}},{"$error":"#N/A"},{"$f":"IF(AND(AB133=26,$Z$4>=12,$Z$4<=17),AB133&\"B\",0)","v":{"$error":"#N/A"}},null,null,{"$f":"IF(AND(AG133>0,AH133>0),AG133,0)","v":{"$error":"#N/A"}},0,{"$f":"IF(AND(AG133=26,$AE$4>=12,$AE$4<=17),AG133&\"B\",0)","v":{"$error":"#N/A"}}]
[null,null,null,null,null,null,null,null,null,null,null,null,null,null,null,null,null,null,null,null,null,null,null,null,null,null,{"$error":"#N/A"},{"$error":"#N/A"},{"$f":"IF(AND(AB134=26,$Z$4>=18,$Z$4<=22),AB134&\"C\",0)","v":{"$error":"#N/A"}},null,null,{"$error":"#N/A"},0,{"$f":"IF(AND(AG134=26,$AE$4>=18,$AE$4<=22),AG134&\"C\",0)","v":{"$error":"#N/A"}}]
[null,null,null,null,null,null,null,null,null,null,null,null,null,null,null,null,null,null,null,null,null,null,null,null,null,null,{"$error":"#N/A"},{"$error":"#N/A"},{"$f":"IF(AND(AB135=26,$Z$4>=23,$Z$4<=26),AB135&\"D\",0)","v":{"$error":"#N/A"}},null,null,{"$error":"#N/A"},0,{"$f":"IF(AND(AG135=26,$AE$4>=23,$AE$4<=26),AG135&\"D\",0)","v":{"$error":"#N/A"}}]
[null,null,null,null,null,null,null,null,null,null,null,null,null,null,null,null,null,null,null,null,null,null,null,null,null,null,{"$error":"#N/A"},{"$error":"#N/A"},{"$f":"IF(AND(AB136=26,$Z$4>=27,$Z$4<=30),AB136&\"E\",0)","v":{"$error":"#N/A"}},null,null,{"$error":"#N/A"},0,{"$f":"IF(AND(AG136=26,$AE$4>=27,$AE$4<=30),AG136&\"E\",0)","v":{"$error":"#N/A"}}]
[null,null,null,null,null,null,null,null,null,null,null,null,null,null,null,null,null,null,null,null,null,null,null,null,null,null,{"$error":"#N/A"},{"$error":"#N/A"},{"$f":"IF(AND(AB137=26,$Z$4>=31,$Z$4<=34),AB137&\"F\",0)","v":{"$error":"#N/A"}},null,null,{"$error":"#N/A"},0,{"$f":"IF(AND(AG137=26,$AE$4>=31,$AE$4<=34),AG137&\"F\",0)","v":{"$error":"#N/A"}}]
[null,null,null,null,null,null,null,null,null,null,null,null,null,null,null,null,null,null,null,null,null,null,null,null,null,null,{"$error":"#N/A"},{"$error":"#N/A"},{"$f":"IF(AND(AB138=26,$Z$4>=35,$Z$4<=38),AB138&\"G\",0)","v":{"$error":"#N/A"}},null,null,{"$error":"#N/A"},0,{"$f":"IF(AND(AG138=26,$AE$4>=35,$AE$4<=38),AG138&\"G\",0)","v":{"$error":"#N/A"}}]
[null,null,null,null,null,null,null,null,null,null,null,null,null,null,null,null,null,null,null,null,null,null,null,null,null,null,{"$error":"#N/A"},{"$error":"#N/A"},{"$f":"IF(AND(AB139=26,$Z$4>=39,$Z$4<=42),AB139&\"H\",0)","v":{"$error":"#N/A"}},null,null,{"$error":"#N/A"},0,{"$f":"IF(AND(AG139=26,$AE$4>=39,$AE$4<=42),AG139&\"H\",0)","v":{"$error":"#N/A"}}]
[null,null,null,null,null,null,null,null,null,null,null,null,null,null,null,null,null,null,null,null,null,null,null,null,null,null,{"$error":"#N/A"},{"$error":"#N/A"},{"$f":"IF(AND(AB140=26,$Z$4>=43,$Z$4<=45),AB140&\"I\",0)","v":{"$error":"#N/A"}},null,null,{"$error":"#N/A"},0,{"$f":"IF(AND(AG140=26,$AE$4>=43,$AE$4<=45),AG140&\"I\",0)","v":{"$error":"#N/A"}}]
[null,null,null,null,null,null,null,null,null,null,null,null,null,null,null,null,null,null,null,null,null,null,null,null,null,null,{"$error":"#N/A"},{"$error":"#N/A"},{"$f":"IF(AND(AB141=26,$Z$4>=46,$Z$4<=52,ModelNo=\"9001\"),\"Dbl.\"&AB141&\"D\",0)","v":{"$error":"#N/A"}},null,null,{"$error":"#N/A"},0,{"$f":"IF(AND(AG141=26,$AE$4>=46,$AE$4<=52,ModelNo=\"9001\"),\"Dbl.\"&AG141&\"D\",0)","v":{"$error":"#N/A"}}]
[null,null,null,null,null,null,null,null,null,null,null,null,null,null,null,null,null,null,null,null,null,null,null,null,null,null,{"$error":"#N/A"},{"$error":"#N/A"},{"$f":"IF(AND(AB142=26,$Z$4>=53,$Z$4<=60,ModelNo=\"9001\"),\"Dbl.\"&AB142&\"E\",0)","v":{"$error":"#N/A"}},null,null,{"$error":"#N/A"},0,{"$f":"IF(AND(AG142=26,$AE$4>=53,$AE$4<=60,ModelNo=\"9001\"),\"Dbl.\"&AG142&\"E\",0)","v":{"$error":"#N/A"}}]
[null,null,null,null,null,null,null,null,null,null,null,null,null,null,null,null,null,null,null,null,null,null,null,null,null,null,{"$error":"#N/A"},{"$error":"#N/A"},{"$f":"IF(AND(AB143=26,$Z$4>=61,$Z$4<=68,ModelNo=\"9001\"),\"Dbl.\"&AB143&\"F\",0)","v":{"$error":"#N/A"}},null,null,{"$error":"#N/A"},0,{"$f":"IF(AND(AG143=26,$AE$4>=61,$AE$4<=68,ModelNo=\"9001\"),\"Dbl.\"&AG143&\"F\",0)","v":{"$error":"#N/A"}}]
[null,null,null,null,null,null,null,null,null,null,null,null,null,null,null,null,null,null,null,null,null,null,null,null,null,null,{"$error":"#N/A"},{"$error":"#N/A"},{"$f":"IF(AND(AB144=26,$Z$4>=69,$Z$4<=76,ModelNo=\"9001\"),\"Dbl.\"&AB144&\"G\",0)","v":{"$error":"#N/A"}},null,null,{"$error":"#N/A"},0,{"$f":"IF(AND(AG144=26,$AE$4>=69,$AE$4<=76,ModelNo=\"9001\"),\"Dbl.\"&AG144&\"G\",0)","v":{"$error":"#N/A"}}]
[null,null,null,null,null,null,null,null,null,null,null,null,null,null,null,null,null,null,null,null,null,null,null,null,null,null,{"$error":"#N/A"},{"$error":"#N/A"},{"$f":"IF(AND(AB145=26,$Z$4>=77,$Z$4<=80,ModelNo=\"9001\"),\"Dbl.\"&AB145&\"H\",0)","v":{"$error":"#N/A"}},null,null,{"$error":"#N/A"},0,{"$f":"IF(AND(AG145=26,$AE$4>=77,$AE$4<=80,ModelNo=\"9001\"),\"Dbl.\"&AG145&\"H\",0)","v":{"$error":"#N/A"}}]
[null,null,null,null,null,null,null,null,null,null,null,null,null,null,null,null,null,null,null,null,null,null,null,null,null,null,{"$error":"#N/A"},{"$f":"IF(AND($AA$4<=28,$AA$4>26),28,0)","v":{"$error":"#N/A"}},{"$f":"IF(AND(AB146=28,$Z$4>=7,$Z$4<=12),AB146&\"A\",0)","v":{"$error":"#N/A"}},null,null,{"$error":"#N/A"},{"$f":"IF(AND($AF$4<=28,$AF$4>26),28,0)","v":0},{"$f":"IF(AND(AG146=28,$AE$4>=7,$AE$4<=12),AG146&\"A\",0)","v":{"$error":"#N/A"}}]
[null,null,null,null,null,null,null,null,null,null,null,null,null,null,null,null,null,null,null,null,null,null,null,null,null,null,{"$error":"#N/A"},{"$error":"#N/A"},{"$f":"IF(AND(AB147=28,$Z$4>=13,$Z$4<=18),AB147&\"B\",0)","v":{"$error":"#N/A"}},null,null,{"$error":"#N/A"},0,{"$f":"IF(AND(AG147=28,$AE$4>=13,$AE$4<=18),AG147&\"B\",0)","v":{"$error":"#N/A"}}]
[null,null,null,null,null,null,null,null,null,null,null,null,null,null,null,null,null,null,null,null,null,null,null,null,null,null,{"$error":"#N/A"},{"$error":"#N/A"},{"$f":"IF(AND(AB148=28,$Z$4>=19,$Z$4<=23),AB148&\"C\",0)","v":{"$error":"#N/A"}},null,null,{"$error":"#N/A"},0,{"$f":"IF(AND(AG148=28,$AE$4>=19,$AE$4<=23),AG148&\"C\",0)","v":{"$error":"#N/A"}}]
[null,null,null,null,null,null,null,null,null,null,null,null,null,null,null,null,null,null,null,null,null,null,null,null,null,null,{"$error":"#N/A"},{"$error":"#N/A"},{"$f":"IF(AND(AB149=28,$Z$4>=24,$Z$4<=28),AB149&\"D\",0)","v":{"$error":"#N/A"}},null,null,{"$error":"#N/A"},0,{"$f":"IF(AND(AG149=28,$AE$4>=24,$AE$4<=28),AG149&\"D\",0)","v":{"$error":"#N/A"}}]
[null,null,null,null,null,null,null,null,null,null,null,null,null,null,null,null,null,null,null,null,null,null,null,null,null,null,{"$error":"#N/A"},{"$error":"#N/A"},{"$f":"IF(AND(AB150=28,$Z$4>=29,$Z$4<=32),AB150&\"E\",0)","v":{"$error":"#N/A"}},null,null,{"$error":"#N/A"},0,{"$f":"IF(AND(AG150=28,$AE$4>=29,$AE$4<=32),AG150&\"E\",0)","v":{"$error":"#N/A"}}]
[null,null,null,null,null,null,null,null,null,null,null,null,null,null,null,null,null,null,null,null,null,null,null,null,null,null,{"$error":"#N/A"},{"$error":"#N/A"},{"$f":"IF(AND(AB151=28,$Z$4>=33,$Z$4<=36),AB151&\"F\",0)","v":{"$error":"#N/A"}},null,null,{"$error":"#N/A"},0,{"$f":"IF(AND(AG151=28,$AE$4>=33,$AE$4<=36),AG151&\"F\",0)","v":{"$error":"#N/A"}}]
[null,null,null,null,null,null,null,null,null,null,null,null,null,null,null,null,null,null,null,null,null,null,null,null,null,null,{"$error":"#N/A"},{"$error":"#N/A"},{"$f":"IF(AND(AB152=28,$Z$4>=37,$Z$4<=40),AB152&\"G\",0)","v":{"$error":"#N/A"}},null,null,{"$error":"#N/A"},0,{"$f":"IF(AND(AG152=28,$AE$4>=37,$AE$4<=40),AG152&\"G\",0)","v":{"$error":"#N/A"}}]
[null,null,null,null,null,null,null,null,null,null,null,null,null,null,null,null,null,null,null,null,null,null,null,null,null,null,{"$error":"#N/A"},{"$error":"#N/A"},{"$f":"IF(AND(AB153=28,$Z$4>=41,$Z$4<=43),AB153&\"H\",0)","v":{"$error":"#N/A"}},null,null,{"$error":"#N/A"},0,{"$f":"IF(AND(AG153=28,$AE$4>=41,$AE$4<=43),AG153&\"H\",0)","v":{"$error":"#N/A"}}]
[null,null,null,null,null,null,null,null,null,null,null,null,null,null,null,null,null,null,null,null,null,null,null,null,null,null,{"$error":"#N/A"},{"$error":"#N/A"},{"$f":"IF(AND(AB154=28,$Z$4>=44,$Z$4<=45),AB154&\"I\",0)","v":{"$error":"#N/A"}},null,null,{"$error":"#N/A"},0,{"$f":"IF(AND(AG154=28,$AE$4>=44,$AE$4<=45),AG154&\"I\",0)","v":{"$error":"#N/A"}}]
[null,null,null,null,null,null,null,null,null,null,null,null,null,null,null,null,null,null,null,null,null,null,null,null,null,null,{"$error":"#N/A"},{"$error":"#N/A"},{"$f":"IF(AND(AB155=28,$Z$4=46,ModelNo=\"9001\"),\"Dbl.\"&AB155&\"C\",0)","v":{"$error":"#N/A"}},null,null,{"$error":"#N/A"},0,{"$f":"IF(AND(AG155=28,$AE$4=46,ModelNo=\"9001\"),\"Dbl.\"&AG155&\"C\",0)","v":{"$error":"#N/A"}}]
[null,null,null,null,null,null,null,null,null,null,null,null,null,null,null,null,null,null,null,null,null,null,null,null,null,null,{"$error":"#N/A"},{"$error":"#N/A"},{"$f":"IF(AND(AB156=28,$Z$4>=47,$Z$4<=56,ModelNo=\"9001\"),\"Dbl.\"&AB156&\"D\",0)","v":{"$error":"#N/A"}},null,null,{"$error":"#N/A"},0,{"$f":"IF(AND(AG156=28,$AE$4>=47,$AE$4<=56,ModelNo=\"9001\"),\"Dbl.\"&AG156&\"D\",0)","v":{"$error":"#N/A"}}]
[null,null,null,null,null,null,null,null,null,null,null,null,null,null,null,null,null,null,null,null,null,null,null,null,null,null,{"$error":"#N/A"},{"$error":"#N/A"},{"$f":"IF(AND(AB157=28,$Z$4>=57,$Z$4<=64,ModelNo=\"9001\"),\"Dbl.\"&AB157&\"E\",0)","v":{"$error":"#N/A"}},null,null,{"$error":"#N/A"},0,{"$f":"IF(AND(AG157=28,$AE$4>=57,$AE$4<=64,ModelNo=\"9001\"),\"Dbl.\"&AG157&\"E\",0)","v":{"$error":"#N/A"}}]
[null,null,null,null,null,null,null,null,null,null,null,null,null,null,null,null,null,null,null,null,null,null,null,null,null,null,{"$error":"#N/A"},{"$error":"#N/A"},{"$f":"IF(AND(AB158=28,$Z$4>=65,$Z$4<=72,ModelNo=\"9001\"),\"Dbl.\"&AB158&\"F\",0)","v":{"$error":"#N/A"}},null,null,{"$error":"#N/A"},0,{"$f":"IF(AND(AG158=28,$AE$4>=65,$AE$4<=72,ModelNo=\"9001\"),\"Dbl.\"&AG158&\"F\",0)","v":{"$error":"#N/A"}}]
[null,null,null,null,null,null,null,null,null,null,null,null,null,null,null,null,null,null,null,null,null,null,null,null,null,null,{"$error":"#N/A"},{"$error":"#N/A"},{"$f":"IF(AND(AB159=28,$Z$4>=73,$Z$4<=80,ModelNo=\"9001\"),\"Dbl.\"&AB159&\"G\",0)","v":{"$error":"#N/A"}},null,null,{"$error":"#N/A"},0,{"$f":"IF(AND(AG159=28,$AE$4>=73,$AE$4<=80,ModelNo=\"9001\"),\"Dbl.\"&AG159&\"G\",0)","v":{"$error":"#N/A"}}]
[null,null,null,null,null,null,null,null,null,null,null,null,null,null,null,null,null,null,null,null,null,null,null,null,null,null,{"$error":"#N/A"},{"$f":"IF(AND($AA$4<=30,$AA$4>28),30,0)","v":{"$error":"#N/A"}},{"$f":"IF(AND(AB160=30,$Z$4>=8,$Z$4<=13),AB160&\"A\",0)","v":{"$error":"#N/A"}},null,null,{"$error":"#N/A"},{"$f":"IF(AND($AF$4<=30,$AF$4>28),30,0)","v":0},{"$f":"IF(AND(AG160=30,$AE$4>=8,$AE$4<=13),AG160&\"A\",0)","v":{"$error":"#N/A"}}]
[null,null,null,null,null,null,null,null,null,null,null,null,null,null,null,null,null,null,null,null,null,null,null,null,null,null,{"$error":"#N/A"},{"$error":"#N/A"},{"$f":"IF(AND(AB161=30,$Z$4>=14,$Z$4<=19),AB161&\"B\",0)","v":{"$error":"#N/A"}},null,null,{"$error":"#N/A"},0,{"$f":"IF(AND(AG161=30,$AE$4>=14,$AE$4<=19),AG161&\"B\",0)","v":{"$error":"#N/A"}}]
[null,null,null,null,null,null,null,null,null,null,null,null,null,null,null,null,null,null,null,null,null,null,null,null,null,null,{"$error":"#N/A"},{"$error":"#N/A"},{"$f":"IF(AND(AB162=30,$Z$4>=20,$Z$4<=24),AB162&\"C\",0)","v":{"$error":"#N/A"}},null,null,{"$error":"#N/A"},0,{"$f":"IF(AND(AG162=30,$AE$4>=20,$AE$4<=24),AG162&\"C\",0)","v":{"$error":"#N/A"}}]
[null,null,null,null,null,null,null,null,null,null,null,null,null,null,null,null,null,null,null,null,null,null,null,null,null,null,{"$error":"#N/A"},{"$error":"#N/A"},{"$f":"IF(AND(AB163=30,$Z$4>=25,$Z$4<=29),AB163&\"D\",0)","v":{"$error":"#N/A"}},null,null,{"$error":"#N/A"},0,{"$f":"IF(AND(AG163=30,$AE$4>=25,$AE$4<=29),AG163&\"D\",0)","v":{"$error":"#N/A"}}]
[null,null,null,null,null,null,null,null,null,null,null,null,null,null,null,null,null,null,null,null,null,null,null,null,null,null,{"$error":"#N/A"},{"$error":"#N/A"},{"$f":"IF(AND(AB164=30,$Z$4>=30,$Z$4<=33),AB164&\"E\",0)","v":{"$error":"#N/A"}},null,null,{"$error":"#N/A"},0,{"$f":"IF(AND(AG164=30,$AE$4>=30,$AE$4<=33),AG164&\"E\",0)","v":{"$error":"#N/A"}}]
[null,null,null,null,null,null,null,null,null,null,null,null,null,null,null,null,null,null,null,null,null,null,null,null,null,null,{"$error":"#N/A"},{"$error":"#N/A"},{"$f":"IF(AND(AB165=30,$Z$4>=34,$Z$4<=37),AB165&\"F\",0)","v":{"$error":"#N/A"}},null,null,{"$error":"#N/A"},0,{"$f":"IF(AND(AG165=30,$AE$4>=34,$AE$4<=37),AG165&\"F\",0)","v":{"$error":"#N/A"}}]
[null,null,null,null,null,null,null,null,null,null,null,null,null,null,null,null,null,null,null,null,null,null,null,null,null,null,{"$error":"#N/A"},{"$error":"#N/A"},{"$f":"IF(AND(AB166=30,$Z$4>=38,$Z$4<=40),AB166&\"G\",0)","v":{"$error":"#N/A"}},null,null,{"$error":"#N/A"},0,{"$f":"IF(AND(AG166=30,$AE$4>=38,$AE$4<=40),AG166&\"G\",0)","v":{"$error":"#N/A"}}]
[null,null,null,null,null,null,null,null,null,null,null,null,null,null,null,null,null,null,null,null,null,null,null,null,null,null,{"$error":"#N/A"},{"$error":"#N/A"},{"$f":"IF(AND(AB167=30,$Z$4>=41,$Z$4<=43),AB167&\"H\",0)","v":{"$error":"#N/A"}},null,null,{"$error":"#N/A"},0,{"$f":"IF(AND(AG167=30,$AE$4>=41,$AE$4<=43),AG167&\"H\",0)","v":{"$error":"#N/A"}}]
[null,null,null,null,null,null,null,null,null,null,null,null,null,null,null,null,null,null,null,null,null,null,null,null,null,null,{"$error":"#N/A"},{"$error":"#N/A"},{"$f":"IF(AND(AB168=30,$Z$4>=44,$Z$4<=45),AB168&\"I\",0)","v":{"$error":"#N/A"}},null,null,{"$error":"#N/A"},0,{"$f":"IF(AND(AG168=30,$AE$4>=44,$AE$4<=45),AG168&\"I\",0)","v":{"$error":"#N/A"}}]
[null,null,null,null,null,null,null,null,null,null,null,null,null,null,null,null,null,null,null,null,null,null,null,null,null,null,{"$error":"#N/A"},{"$error":"#N/A"},{"$f":"IF(AND(AB169=30,$Z$4>=46,$Z$4<=48,ModelNo=\"9001\"),\"Dbl.\"&AB169&\"C\",0)","v":{"$error":"#N/A"}},null,null,{"$error":"#N/A"},0,{"$f":"IF(AND(AG169=30,$AE$4>=46,$AE$4<=48,ModelNo=\"9001\"),\"Dbl.\"&AG169&\"C\",0)","v":{"$error":"#N/A"}}]
[null,null,null,null,null,null,null,null,null,null,null,null,null,null,null,null,null,null,null,null,null,null,null,null,null,null,{"$error":"#N/A"},{"$error":"#N/A"},{"$f":"IF(AND(AB170=30,$Z$4>=49,$Z$4<=58,ModelNo=\"9001\"),\"Dbl.\"&AB170&\"D\",0)","v":{"$error":"#N/A"}},null,null,{"$error":"#N/A"},0,{"$f":"IF(AND(AG170=30,$AE$4>=49,$AE$4<=58,ModelNo=\"9001\"),\"Dbl.\"&AG170&\"D\",0)","v":{"$error":"#N/A"}}]
[null,null,null,null,null,null,null,null,null,null,null,null,null,null,null,null,null,null,null,null,null,null,null,null,null,null,{"$error":"#N/A"},{"$error":"#N/A"},{"$f":"IF(AND(AB171=30,$Z$4>=59,$Z$4<=66,ModelNo=\"9001\"),\"Dbl.\"&AB171&\"E\",0)","v":{"$error":"#N/A"}},null,null,{"$error":"#N/A"},0,{"$f":"IF(AND(AG171=30,$AE$4>=59,$AE$4<=66,ModelNo=\"9001\"),\"Dbl.\"&AG171&\"E\",0)","v":{"$error":"#N/A"}}]
[null,null,null,null,null,null,null,null,null,null,null,null,null,null,null,null,null,null,null,null,null,null,null,null,null,null,{"$error":"#N/A"},{"$error":"#N/A"},{"$f":"IF(AND(AB172=30,$Z$4>=67,$Z$4<=74,ModelNo=\"9001\"),\"Dbl.\"&AB172&\"F\",0)","v":{"$error":"#N/A"}},null,null,{"$error":"#N/A"},0,{"$f":"IF(AND(AG172=30,$AE$4>=67,$AE$4<=74,ModelNo=\"9001\"),\"Dbl.\"&AG172&\"F\",0)","v":{"$error":"#N/A"}}]
[null,null,null,null,null,null,null,null,null,null,null,null,null,null,null,null,null,null,null,null,null,null,null,null,null,null,{"$error":"#N/A"},{"$error":"#N/A"},{"$f":"IF(AND(AB173=30,$Z$4>=75,$Z$4<=80,ModelNo=\"9001\"),\"Dbl.\"&AB173&\"G\",0)","v":{"$error":"#N/A"}},null,null,{"$error":"#N/A"},0,{"$f":"IF(AND(AG173=30,$AE$4>=75,$AE$4<=80,ModelNo=\"9001\"),\"Dbl.\"&AG173&\"G\",0)","v":{"$error":"#N/A"}}]
[null,null,null,null,null,null,null,null,null,null,null,null,null,null,null,null,null,null,null,null,null,null,null,null,null,null,{"$error":"#N/A"},{"$f":"IF(AND($AA$4<=32,$AA$4>30),32,0)","v":{"$error":"#N/A"}},{"$f":"IF(AND(AB174=32,$Z$4>=8,$Z$4<=14),AB174&\"A\",0)","v":{"$error":"#N/A"}},null,null,{"$error":"#N/A"},{"$f":"IF(AND($AF$4<=32,$AF$4>30),32,0)","v":0},{"$f":"IF(AND(AG174=32,$AE$4>=8,$AE$4<=14),AG174&\"A\",0)","v":{"$error":"#N/A"}}]
[null,null,null,null,null,null,null,null,null,null,null,null,null,null,null,null,null,null,null,null,null,null,null,null,null,null,{"$error":"#N/A"},{"$error":"#N/A"},{"$f":"IF(AND(AB175=32,$Z$4>=15,$Z$4<=20),AB175&\"B\",0)","v":{"$error":"#N/A"}},null,null,{"$error":"#N/A"},0,{"$f":"IF(AND(AG175=32,$AE$4>=15,$AE$4<=20),AG175&\"B\",0)","v":{"$error":"#N/A"}}]
[null,null,null,null,null,null,null,null,null,null,null,null,null,null,null,null,null,null,null,null,null,null,null,null,null,null,{"$error":"#N/A"},{"$error":"#N/A"},{"$f":"IF(AND(AB176=32,$Z$4>=21,$Z$4<=25),AB176&\"C\",0)","v":{"$error":"#N/A"}},null,null,{"$error":"#N/A"},0,{"$f":"IF(AND(AG176=32,$AE$4>=21,$AE$4<=25),AG176&\"C\",0)","v":{"$error":"#N/A"}}]
[null,null,null,null,null,null,null,null,null,null,null,null,null,null,null,null,null,null,null,null,null,null,null,null,null,null,{"$error":"#N/A"},{"$error":"#N/A"},{"$f":"IF(AND(AB177=32,$Z$4>=26,$Z$4<=30),AB177&\"D\",0)","v":{"$error":"#N/A"}},null,null,{"$error":"#N/A"},0,{"$f":"IF(AND(AG177=32,$AE$4>=26,$AE$4<=30),AG177&\"D\",0)","v":{"$error":"#N/A"}}]
[null,null,null,null,null,null,null,null,null,null,null,null,null,null,null,null,null,null,null,null,null,null,null,null,null,null,{"$error":"#N/A"},{"$error":"#N/A"},{"$f":"IF(AND(AB178=32,$Z$4>=31,$Z$4<=34),AB178&\"E\",0)","v":{"$error":"#N/A"}},null,null,{"$error":"#N/A"},0,{"$f":"IF(AND(AG178=32,$AE$4>=31,$AE$4<=34),AG178&\"E\",0)","v":{"$error":"#N/A"}}]
[null,null,null,null,null,null,null,null,null,null,null,null,null,null,null,null,null,null,null,null,null,null,null,null,null,null,{"$error":"#N/A"},{"$error":"#N/A"},{"$f":"IF(AND(AB179=32,$Z$4>=35,$Z$4<=37),AB179&\"F\",0)","v":{"$error":"#N/A"}},null,null,{"$error":"#N/A"},0,{"$f":"IF(AND(AG179=32,$AE$4>=35,$AE$4<=37),AG179&\"F\",0)","v":{"$error":"#N/A"}}]
[null,null,null,null,null,null,null,null,null,null,null,null,null,null,null,null,null,null,null,null,null,null,null,null,null,null,{"$error":"#N/A"},{"$error":"#N/A"},{"$f":"IF(AND(AB180=32,$Z$4>=38,$Z$4<=40),AB180&\"G\",0)","v":{"$error":"#N/A"}},null,null,{"$error":"#N/A"},0,{"$f":"IF(AND(AG180=32,$AE$4>=38,$AE$4<=40),AG180&\"G\",0)","v":{"$error":"#N/A"}}]
[null,null,null,null,null,null,null,null,null,null,null,null,null,null,null,null,null,null,null,null,null,null,null,null,null,null,{"$error":"#N/A"},{"$error":"#N/A"},{"$f":"IF(AND(AB181=32,$Z$4>=41,$Z$4<=43),AB181&\"H\",0)","v":{"$error":"#N/A"}},null,null,{"$error":"#N/A"},0,{"$f":"IF(AND(AG181=32,$AE$4>=41,$AE$4<=43),AG181&\"H\",0)","v":{"$error":"#N/A"}}]
[null,null,null,null,null,null,null,null,null,null,null,null,null,null,null,null,null,null,null,null,null,null,null,null,null,null,{"$error":"#N/A"},{"$error":"#N/A"},{"$f":"IF(AND(AB182=32,$Z$4>=44,$Z$4<=45),AB182&\"I\",0)","v":{"$error":"#N/A"}},null,null,{"$error":"#N/A"},0,{"$f":"IF(AND(AG182=32,$AE$4>=44,$AE$4<=45),AG182&\"I\",0)","v":{"$error":"#N/A"}}]
[null,null,null,null,null,null,null,null,null,null,null,null,null,null,null,null,null,null,null,null,null,null,null,null,null,null,{"$error":"#N/A"},{"$error":"#N/A"},{"$f":"IF(AND(AB183=32,$Z$4>=46,$Z$4<=50,ModelNo=\"9001\"),\"Dbl.\"&AB183&\"C\",0)","v":{"$error":"#N/A"}},null,null,{"$error":"#N/A"},0,{"$f":"IF(AND(AG183=32,$AE$4>=46,$AE$4<=50,ModelNo=\"9001\"),\"Dbl.\"&AG183&\"C\",0)","v":{"$error":"#N/A"}}]
[null,null,null,null,null,null,null,null,null,null,null,null,null,null,null,null,null,null,null,null,null,null,null,null,null,null,{"$error":"#N/A"},{"$error":"#N/A"},{"$f":"IF(AND(AB184=32,$Z$4>=51,$Z$4<=60,ModelNo=\"9001\"),\"Dbl.\"&AB184&\"D\",0)","v":{"$error":"#N/A"}},null,null,{"$error":"#N/A"},0,{"$f":"IF(AND(AG184=32,$AE$4>=51,$AE$4<=60,ModelNo=\"9001\"),\"Dbl.\"&AG184&\"D\",0)","v":{"$error":"#N/A"}}]
[null,null,null,null,null,null,null,null,null,null,null,null,null,null,null,null,null,null,null,null,null,null,null,null,null,null,{"$error":"#N/A"},{"$error":"#N/A"},{"$f":"IF(AND(AB185=32,$Z$4>=61,$Z$4<=68,ModelNo=\"9001\"),\"Dbl.\"&AB185&\"E\",0)","v":{"$error":"#N/A"}},null,null,{"$error":"#N/A"},0,{"$f":"IF(AND(AG185=32,$AE$4>=61,$AE$4<=68,ModelNo=\"9001\"),\"Dbl.\"&AG185&\"E\",0)","v":{"$error":"#N/A"}}]
[null,null,null,null,null,null,null,null,null,null,null,null,null,null,null,null,null,null,null,null,null,null,null,null,null,null,{"$error":"#N/A"},{"$error":"#N/A"},{"$f":"IF(AND(AB186=32,$Z$4>=69,$Z$4<=74,ModelNo=\"9001\"),\"Dbl.\"&AB186&\"F\",0)","v":{"$error":"#N/A"}},null,null,{"$error":"#N/A"},0,{"$f":"IF(AND(AG186=32,$AE$4>=69,$AE$4<=74,ModelNo=\"9001\"),\"Dbl.\"&AG186&\"F\",0)","v":{"$error":"#N/A"}}]
[null,null,null,null,null,null,null,null,null,null,null,null,null,null,null,null,null,null,null,null,null,null,null,null,null,null,{"$error":"#N/A"},{"$error":"#N/A"},{"$f":"IF(AND(AB187=32,$Z$4>=75,$Z$4<=80,ModelNo=\"9001\"),\"Dbl.\"&AB187&\"G\",0)","v":{"$error":"#N/A"}},null,null,{"$error":"#N/A"},0,{"$f":"IF(AND(AG187=32,$AE$4>=75,$AE$4<=80,ModelNo=\"9001\"),\"Dbl.\"&AG187&\"G\",0)","v":{"$error":"#N/A"}}]
[null,null,null,null,null,null,null,null,null,null,null,null,null,null,null,null,null,null,null,null,null,null,null,null,null,null,{"$error":"#N/A"},{"$f":"IF(AND($AA$4<=34,$AA$4>32),34,0)","v":{"$error":"#N/A"}},{"$f":"IF(AND(AB188=34,$Z$4>=11,$Z$4<=16),AB188&\"A\",0)","v":{"$error":"#N/A"}},null,null,{"$error":"#N/A"},{"$f":"IF(AND($AF$4<=34,$AF$4>32),34,0)","v":0},{"$f":"IF(AND(AG188=34,$AE$4>=11,$AE$4<=16),AG188&\"A\",0)","v":{"$error":"#N/A"}}]
[null,null,null,null,null,null,null,null,null,null,null,null,null,null,null,null,null,null,null,null,null,null,null,null,null,null,{"$error":"#N/A"},{"$error":"#N/A"},{"$f":"IF(AND(AB189=34,$Z$4>=17,$Z$4<=22),AB189&\"B\",0)","v":{"$error":"#N/A"}},null,null,{"$error":"#N/A"},0,{"$f":"IF(AND(AG189=34,$AE$4>=17,$AE$4<=22),AG189&\"B\",0)","v":{"$error":"#N/A"}}]
[null,null,null,null,null,null,null,null,null,null,null,null,null,null,null,null,null,null,null,null,null,null,null,null,null,null,{"$error":"#N/A"},{"$error":"#N/A"},{"$f":"IF(AND(AB190=34,$Z$4>=23,$Z$4<=27),AB190&\"C\",0)","v":{"$error":"#N/A"}},null,null,{"$error":"#N/A"},0,{"$f":"IF(AND(AG190=34,$AE$4>=23,$AE$4<=27),AG190&\"C\",0)","v":{"$error":"#N/A"}}]
[null,null,null,null,null,null,null,null,null,null,null,null,null,null,null,null,null,null,null,null,null,null,null,null,null,null,{"$error":"#N/A"},{"$error":"#N/A"},{"$f":"IF(AND(AB191=34,$Z$4>=28,$Z$4<=32),AB191&\"D\",0)","v":{"$error":"#N/A"}},null,null,{"$error":"#N/A"},0,{"$f":"IF(AND(AG191=34,$AE$4>=28,$AE$4<=32),AG191&\"D\",0)","v":{"$error":"#N/A"}}]
[null,null,null,null,null,null,null,null,null,null,null,null,null,null,null,null,null,null,null,null,null,null,null,null,null,null,{"$error":"#N/A"},{"$error":"#N/A"},{"$f":"IF(AND(AB192=34,$Z$4>=33,$Z$4<=34),AB192&\"E\",0)","v":{"$error":"#N/A"}},null,null,{"$error":"#N/A"},0,{"$f":"IF(AND(AG192=34,$AE$4>=33,$AE$4<=34),AG192&\"E\",0)","v":{"$error":"#N/A"}}]
[null,null,null,null,null,null,null,null,null,null,null,null,null,null,null,null,null,null,null,null,null,null,null,null,null,null,{"$error":"#N/A"},{"$error":"#N/A"},{"$f":"IF(AND(AB193=34,$Z$4>=35,$Z$4<=37),AB193&\"F\",0)","v":{"$error":"#N/A"}},null,null,{"$error":"#N/A"},0,{"$f":"IF(AND(AG193=34,$AE$4>=35,$AE$4<=37),AG193&\"F\",0)","v":{"$error":"#N/A"}}]
[null,null,null,null,null,null,null,null,null,null,null,null,null,null,null,null,null,null,null,null,null,null,null,null,null,null,{"$error":"#N/A"},{"$error":"#N/A"},{"$f":"IF(AND(AB194=34,$Z$4>=38,$Z$4<=40),AB194&\"G\",0)","v":{"$error":"#N/A"}},null,null,{"$error":"#N/A"},0,{"$f":"IF(AND(AG194=34,$AE$4>=38,$AE$4<=40),AG194&\"G\",0)","v":{"$error":"#N/A"}}]
[null,null,null,null,null,null,null,null,null,null,null,null,null,null,null,null,null,null,null,null,null,null,null,null,null,null,{"$error":"#N/A"},{"$error":"#N/A"},{"$f":"IF(AND(AB195=34,$Z$4>=41,$Z$4<=43),AB195&\"H\",0)","v":{"$error":"#N/A"}},null,null,{"$error":"#N/A"},0,{"$f":"IF(AND(AG195=34,$AE$4>=41,$AE$4<=43),AG195&\"H\",0)","v":{"$error":"#N/A"}}]
[null,null,null,null,null,null,null,null,null,null,null,null,null,null,null,null,null,null,null,null,null,null,null,null,null,null,{"$error":"#N/A"},{"$error":"#N/A"},{"$f":"IF(AND(AB196=34,$Z$4>=44,$Z$4<=45),AB196&\"I\",0)","v":{"$error":"#N/A"}},null,null,{"$error":"#N/A"},0,{"$f":"IF(AND(AG196=34,$AE$4>=44,$AE$4<=45),AG196&\"I\",0)","v":{"$error":"#N/A"}}]
[null,null,null,null,null,null,null,null,null,null,null,null,null,null,null,null,null,null,null,null,null,null,null,null,null,null,{"$f":"IF(AND(AB197>0,AC197>0),AB197,0)","v":{"$error":"#N/A"}},{"$error":"#N/A"},{"$f":"IF(AND(AB197=34,$Z$4>=46,$Z$4<=54,ModelNo=\"9001\"),\"Dbl.\"&AB197&\"C\",0)","v":{"$error":"#N/A"}},null,null,{"$f":"IF(AND(AG197>0,AH197>0),AG197,0)","v":{"$error":"#N/A"}},0,{"$f":"IF(AND(AG197=34,$AE$4>=46,$AE$4<=54,ModelNo=\"9001\"),\"Dbl.\"&AG197&\"C\",0)","v":{"$error":"#N/A"}}]
[null,null,null,null,null,null,null,null,null,null,null,null,null,null,null,null,null,null,null,null,null,null,null,null,null,null,{"$error":"#N/A"},{"$error":"#N/A"},{"$f":"IF(AND(AB198=34,$Z$4>=55,$Z$4<=64,ModelNo=\"9001\"),\"Dbl.\"&AB198&\"D\",0)","v":{"$error":"#N/A"}},null,null,{"$error":"#N/A"},0,{"$f":"IF(AND(AG198=34,$AE$4>=55,$AE$4<=64,ModelNo=\"9001\"),\"Dbl.\"&AG198&\"D\",0)","v":{"$error":"#N/A"}}]
[null,null,null,null,null,null,null,null,null,null,null,null,null,null,null,null,null,null,null,null,null,null,null,null,null,null,{"$error":"#N/A"},{"$error":"#N/A"},{"$f":"IF(AND(AB199=34,$Z$4>=65,$Z$4<=68,ModelNo=\"9001\"),\"Dbl.\"&AB199&\"E\",0)","v":{"$error":"#N/A"}},null,null,{"$error":"#N/A"},0,{"$f":"IF(AND(AG199=34,$AE$4>=65,$AE$4<=68,ModelNo=\"9001\"),\"Dbl.\"&AG199&\"E\",0)","v":{"$error":"#N/A"}}]
[null,null,null,null,null,null,null,null,null,null,null,null,null,null,null,null,null,null,null,null,null,null,null,null,null,null,{"$error":"#N/A"},{"$error":"#N/A"},{"$f":"IF(AND(AB200=34,$Z$4>=69,$Z$4<=74,ModelNo=\"9001\"),\"Dbl.\"&AB200&\"F\",0)","v":{"$error":"#N/A"}},null,null,{"$error":"#N/A"},0,{"$f":"IF(AND(AG200=34,$AE$4>=69,$AE$4<=74,ModelNo=\"9001\"),\"Dbl.\"&AG200&\"F\",0)","v":{"$error":"#N/A"}}]
[null,null,null,null,null,null,null,null,null,null,null,null,null,null,null,null,null,null,null,null,null,null,null,null,null,null,{"$error":"#N/A"},{"$error":"#N/A"},{"$f":"IF(AND(AB201=34,$Z$4>=75,$Z$4<=80,ModelNo=\"9001\"),\"Dbl.\"&AB201&\"G\",0)","v":{"$error":"#N/A"}},null,null,{"$error":"#N/A"},0,{"$f":"IF(AND(AG201=34,$AE$4>=75,$AE$4<=80,ModelNo=\"9001\"),\"Dbl.\"&AG201&\"G\",0)","v":{"$error":"#N/A"}}]
[null,null,null,null,null,null,null,null,null,null,null,null,null,null,null,null,null,null,null,null,null,null,null,null,null,null,{"$error":"#N/A"},{"$f":"IF(AND($AA$4<=36,$AA$4>34),36,0)","v":{"$error":"#N/A"}},{"$f":"IF(AND(AB202=36,$Z$4>=11,$Z$4<=16),AB202&\"A\",0)","v":{"$error":"#N/A"}},null,null,{"$error":"#N/A"},{"$f":"IF(AND($AF$4<=36,$AF$4>34),36,0)","v":0},{"$f":"IF(AND(AG202=36,$AE$4>=11,$AE$4<=16),AG202&\"A\",0)","v":{"$error":"#N/A"}}]
[null,null,null,null,null,null,null,null,null,null,null,null,null,null,null,null,null,null,null,null,null,null,null,null,null,null,{"$error":"#N/A"},{"$error":"#N/A"},{"$f":"IF(AND(AB203=36,$Z$4>=17,$Z$4<=22),AB203&\"B\",0)","v":{"$error":"#N/A"}},null,null,{"$error":"#N/A"},0,{"$f":"IF(AND(AG203=36,$AE$4>=17,$AE$4<=22),AG203&\"B\",0)","v":{"$error":"#N/A"}}]
[null,null,null,null,null,null,null,null,null,null,null,null,null,null,null,null,null,null,null,null,null,null,null,null,null,null,{"$error":"#N/A"},{"$error":"#N/A"},{"$f":"IF(AND(AB204=36,$Z$4>=23,$Z$4<=27),AB204&\"C\",0)","v":{"$error":"#N/A"}},null,null,{"$error":"#N/A"},0,{"$f":"IF(AND(AG204=36,$AE$4>=23,$AE$4<=27),AG204&\"C\",0)","v":{"$error":"#N/A"}}]
[null,null,null,null,null,null,null,null,null,null,null,null,null,null,null,null,null,null,null,null,null,null,null,null,null,null,{"$error":"#N/A"},{"$error":"#N/A"},{"$f":"IF(AND(AB205=36,$Z$4>=28,$Z$4<=32),AB205&\"D\",0)","v":{"$error":"#N/A"}},null,null,{"$error":"#N/A"},0,{"$f":"IF(AND(AG205=36,$AE$4>=28,$AE$4<=32),AG205&\"D\",0)","v":{"$error":"#N/A"}}]
[null,null,null,null,null,null,null,null,null,null,null,null,null,null,null,null,null,null,null,null,null,null,null,null,null,null,{"$error":"#N/A"},{"$error":"#N/A"},{"$f":"IF(AND(AB206=36,$Z$4>=33,$Z$4<=34),AB206&\"E\",0)","v":{"$error":"#N/A"}},null,null,{"$error":"#N/A"},0,{"$f":"IF(AND(AG206=36,$AE$4>=33,$AE$4<=34),AG206&\"E\",0)","v":{"$error":"#N/A"}}]
[null,null,null,null,null,null,null,null,null,null,null,null,null,null,null,null,null,null,null,null,null,null,null,null,null,null,{"$error":"#N/A"},{"$error":"#N/A"},{"$f":"IF(AND(AB207=36,$Z$4>=35,$Z$4<=37),AB207&\"F\",0)","v":{"$error":"#N/A"}},null,null,{"$error":"#N/A"},0,{"$f":"IF(AND(AG207=36,$AE$4>=35,$AE$4<=37),AG207&\"F\",0)","v":{"$error":"#N/A"}}]
[null,null,null,null,null,null,null,null,null,null,null,null,null,null,null,null,null,null,null,null,null,null,null,null,null,null,{"$error":"#N/A"},{"$error":"#N/A"},{"$f":"IF(AND(AB208=36,$Z$4>=38,$Z$4<=40),AB208&\"G\",0)","v":{"$error":"#N/A"}},null,null,{"$error":"#N/A"},0,{"$f":"IF(AND(AG208=36,$AE$4>=38,$AE$4<=40),AG208&\"G\",0)","v":{"$error":"#N/A"}}]
[null,null,null,null,null,null,null,null,null,null,null,null,null,null,null,null,null,null,null,null,null,null,null,null,null,null,{"$error":"#N/A"},{"$error":"#N/A"},{"$f":"IF(AND(AB209=36,$Z$4>=41,$Z$4<=43),AB209&\"H\",0)","v":{"$error":"#N/A"}},null,null,{"$error":"#N/A"},0,{"$f":"IF(AND(AG209=36,$AE$4>=41,$AE$4<=43),AG209&\"H\",0)","v":{"$error":"#N/A"}}]
[null,null,null,null,null,null,null,null,null,null,null,null,null,null,null,null,null,null,null,null,null,null,null,null,null,null,{"$error":"#N/A"},{"$error":"#N/A"},{"$f":"IF(AND(AB210=36,$Z$4>=44,$Z$4<=45),AB210&\"I\",0)","v":{"$error":"#N/A"}},null,null,{"$error":"#N/A"},0,{"$f":"IF(AND(AG210=36,$AE$4>=44,$AE$4<=45),AG210&\"I\",0)","v":{"$error":"#N/A"}}]
[null,null,null,null,null,null,null,null,null,null,null,null,null,null,null,null,null,null,null,null,null,null,null,null,null,null,{"$error":"#N/A"},{"$error":"#N/A"},{"$f":"IF(AND(AB211=36,$Z$4>=46,$Z$4<=54,ModelNo=\"9001\"),\"Dbl.\"&AB211&\"C\",0)","v":{"$error":"#N/A"}},null,null,{"$error":"#N/A"},0,{"$f":"IF(AND(AG211=36,$AE$4>=46,$AE$4<=54,ModelNo=\"9001\"),\"Dbl.\"&AG211&\"C\",0)","v":{"$error":"#N/A"}}]
[null,null,null,null,null,null,null,null,null,null,null,null,null,null,null,null,null,null,null,null,null,null,null,null,null,null,{"$error":"#N/A"},{"$error":"#N/A"},{"$f":"IF(AND(AB212=36,$Z$4>=55,$Z$4<=64,ModelNo=\"9001\"),\"Dbl.\"&AB212&\"D\",0)","v":{"$error":"#N/A"}},null,null,{"$error":"#N/A"},0,{"$f":"IF(AND(AG212=36,$AE$4>=55,$AE$4<=64,ModelNo=\"9001\"),\"Dbl.\"&AG212&\"D\",0)","v":{"$error":"#N/A"}}]
[null,null,null,null,null,null,null,null,null,null,null,null,null,null,null,null,null,null,null,null,null,null,null,null,null,null,{"$error":"#N/A"},{"$error":"#N/A"},{"$f":"IF(AND(AB213=36,$Z$4>=65,$Z$4<=68,ModelNo=\"9001\"),\"Dbl.\"&AB213&\"E\",0)","v":{"$error":"#N/A"}},null,null,{"$error":"#N/A"},0,{"$f":"IF(AND(AG213=36,$AE$4>=65,$AE$4<=68,ModelNo=\"9001\"),\"Dbl.\"&AG213&\"E\",0)","v":{"$error":"#N/A"}}]
[null,null,null,null,null,null,null,null,null,null,null,null,null,null,null,null,null,null,null,null,null,null,null,null,null,null,{"$error":"#N/A"},{"$error":"#N/A"},{"$f":"IF(AND(AB214=36,$Z$4>=69,$Z$4<=74,ModelNo=\"9001\"),\"Dbl.\"&AB214&\"F\",0)","v":{"$error":"#N/A"}},null,null,{"$error":"#N/A"},0,{"$f":"IF(AND(AG214=36,$AE$4>=69,$AE$4<=74,ModelNo=\"9001\"),\"Dbl.\"&AG214&\"F\",0)","v":{"$error":"#N/A"}}]
[null,null,null,null,null,null,null,null,null,null,null,null,null,null,null,null,null,null,null,null,null,null,null,null,null,null,{"$error":"#N/A"},{"$error":"#N/A"},{"$f":"IF(AND(AB215=36,$Z$4>=75,$Z$4<=80,ModelNo=\"9001\"),\"Dbl.\"&AB215&\"G\",0)","v":{"$error":"#N/A"}},null,null,{"$error":"#N/A"},0,{"$f":"IF(AND(AG215=36,$AE$4>=75,$AE$4<=80,ModelNo=\"9001\"),\"Dbl.\"&AG215&\"G\",0)","v":{"$error":"#N/A"}}]
[null,null,null,null,null,null,null,null,null,null,null,null,null,null,null,null,null,null,null,null,null,null,null,null,null,null,{"$error":"#N/A"},{"$f":"IF(AND($AA$4<=38,$AA$4>36),38,0)","v":{"$error":"#N/A"}},{"$f":"IF(AND(AB216=38,$Z$4>=11,$Z$4<=16),AB216&\"A\",0)","v":{"$error":"#N/A"}},null,null,{"$error":"#N/A"},{"$f":"IF(AND($AF$4<=38,$AF$4>36),38,0)","v":0},{"$f":"IF(AND(AG216=38,$AE$4>=11,$AE$4<=16),AG216&\"A\",0)","v":{"$error":"#N/A"}}]
[null,null,null,null,null,null,null,null,null,null,null,null,null,null,null,null,null,null,null,null,null,null,null,null,null,null,{"$error":"#N/A"},{"$error":"#N/A"},{"$f":"IF(AND(AB217=38,$Z$4>=17,$Z$4<=22),AB217&\"B\",0)","v":{"$error":"#N/A"}},null,null,{"$error":"#N/A"},0,{"$f":"IF(AND(AG217=38,$AE$4>=17,$AE$4<=22),AG217&\"B\",0)","v":{"$error":"#N/A"}}]
[null,null,null,null,null,null,null,null,null,null,null,null,null,null,null,null,null,null,null,null,null,null,null,null,null,null,{"$error":"#N/A"},{"$error":"#N/A"},{"$f":"IF(AND(AB218=38,$Z$4>=23,$Z$4<=27),AB218&\"C\",0)","v":{"$error":"#N/A"}},null,null,{"$error":"#N/A"},0,{"$f":"IF(AND(AG218=38,$AE$4>=23,$AE$4<=27),AG218&\"C\",0)","v":{"$error":"#N/A"}}]
[null,null,null,null,null,null,null,null,null,null,null,null,null,null,null,null,null,null,null,null,null,null,null,null,null,null,{"$error":"#N/A"},{"$error":"#N/A"},{"$f":"IF(AND(AB219=38,$Z$4>=28,$Z$4<=32),AB219&\"D\",0)","v":{"$error":"#N/A"}},null,null,{"$error":"#N/A"},0,{"$f":"IF(AND(AG219=38,$AE$4>=28,$AE$4<=32),AG219&\"D\",0)","v":{"$error":"#N/A"}}]
[null,null,null,null,null,null,null,null,null,null,null,null,null,null,null,null,null,null,null,null,null,null,null,null,null,null,{"$error":"#N/A"},{"$error":"#N/A"},{"$f":"IF(AND(AB220=38,$Z$4>=33,$Z$4<=34),AB220&\"E\",0)","v":{"$error":"#N/A"}},null,null,{"$error":"#N/A"},0,{"$f":"IF(AND(AG220=38,$AE$4>=33,$AE$4<=34),AG220&\"E\",0)","v":{"$error":"#N/A"}}]
[null,null,null,null,null,null,null,null,null,null,null,null,null,null,null,null,null,null,null,null,null,null,null,null,null,null,{"$error":"#N/A"},{"$error":"#N/A"},{"$f":"IF(AND(AB221=38,$Z$4>=35,$Z$4<=37),AB221&\"F\",0)","v":{"$error":"#N/A"}},null,null,{"$error":"#N/A"},0,{"$f":"IF(AND(AG221=38,$AE$4>=35,$AE$4<=37),AG221&\"F\",0)","v":{"$error":"#N/A"}}]
[null,null,null,null,null,null,null,null,null,null,null,null,null,null,null,null,null,null,null,null,null,null,null,null,null,null,{"$error":"#N/A"},{"$error":"#N/A"},{"$f":"IF(AND(AB222=38,$Z$4>=38,$Z$4<=40),AB222&\"G\",0)","v":{"$error":"#N/A"}},null,null,{"$error":"#N/A"},0,{"$f":"IF(AND(AG222=38,$AE$4>=38,$AE$4<=40),AG222&\"G\",0)","v":{"$error":"#N/A"}}]
[null,null,null,null,null,null,null,null,null,null,null,null,null,null,null,null,null,null,null,null,null,null,null,null,null,null,{"$error":"#N/A"},{"$error":"#N/A"},{"$f":"IF(AND(AB223=38,$Z$4>=41,$Z$4<=43),AB223&\"H\",0)","v":{"$error":"#N/A"}},null,null,{"$error":"#N/A"},0,{"$f":"IF(AND(AG223=38,$AE$4>=41,$AE$4<=43),AG223&\"H\",0)","v":{"$error":"#N/A"}}]
[null,null,null,null,null,null,null,null,null,null,null,null,null,null,null,null,null,null,null,null,null,null,null,null,null,null,{"$error":"#N/A"},{"$error":"#N/A"},{"$f":"IF(AND(AB224=38,$Z$4>=44,$Z$4<=45),AB224&\"I\",0)","v":{"$error":"#N/A"}},null,null,{"$error":"#N/A"},0,{"$f":"IF(AND(AG224=38,$AE$4>=44,$AE$4<=45),AG224&\"I\",0)","v":{"$error":"#N/A"}}]
[null,null,null,null,null,null,null,null,null,null,null,null,null,null,null,null,null,null,null,null,null,null,null,null,null,null,{"$error":"#N/A"},{"$error":"#N/A"},{"$f":"IF(AND(AB225=38,$Z$4>=46,$Z$4<=54,ModelNo=\"9001\"),\"Dbl.\"&AB225&\"C\",0)","v":{"$error":"#N/A"}},null,null,{"$error":"#N/A"},0,{"$f":"IF(AND(AG225=38,$AE$4>=46,$AE$4<=54,ModelNo=\"9001\"),\"Dbl.\"&AG225&\"C\",0)","v":{"$error":"#N/A"}}]
[null,null,null,null,null,null,null,null,null,null,null,null,null,null,null,null,null,null,null,null,null,null,null,null,null,null,{"$error":"#N/A"},{"$error":"#N/A"},{"$f":"IF(AND(AB226=38,$Z$4>=55,$Z$4<=64,ModelNo=\"9001\"),\"Dbl.\"&AB226&\"D\",0)","v":{"$error":"#N/A"}},null,null,{"$error":"#N/A"},0,{"$f":"IF(AND(AG226=38,$AE$4>=55,$AE$4<=64,ModelNo=\"9001\"),\"Dbl.\"&AG226&\"D\",0)","v":{"$error":"#N/A"}}]
[null,null,null,null,null,null,null,null,null,null,null,null,null,null,null,null,null,null,null,null,null,null,null,null,null,null,{"$error":"#N/A"},{"$error":"#N/A"},{"$f":"IF(AND(AB227=38,$Z$4>=65,$Z$4<=68,ModelNo=\"9001\"),\"Dbl.\"&AB227&\"E\",0)","v":{"$error":"#N/A"}},null,null,{"$error":"#N/A"},0,{"$f":"IF(AND(AG227=38,$AE$4>=65,$AE$4<=68,ModelNo=\"9001\"),\"Dbl.\"&AG227&\"E\",0)","v":{"$error":"#N/A"}}]
[null,null,null,null,null,null,null,null,null,null,null,null,null,null,null,null,null,null,null,null,null,null,null,null,null,null,{"$error":"#N/A"},{"$error":"#N/A"},{"$f":"IF(AND(AB228=38,$Z$4>=69,$Z$4<=74,ModelNo=\"9001\"),\"Dbl.\"&AB228&\"F\",0)","v":{"$error":"#N/A"}},null,null,{"$error":"#N/A"},0,{"$f":"IF(AND(AG228=38,$AE$4>=69,$AE$4<=74,ModelNo=\"9001\"),\"Dbl.\"&AG228&\"F\",0)","v":{"$error":"#N/A"}}]
[null,null,null,null,null,null,null,null,null,null,null,null,null,null,null,null,null,null,null,null,null,null,null,null,null,null,{"$error":"#N/A"},{"$error":"#N/A"},{"$f":"IF(AND(AB229=38,$Z$4>=75,$Z$4<=80,ModelNo=\"9001\"),\"Dbl.\"&AB229&\"G\",0)","v":{"$error":"#N/A"}},null,null,{"$error":"#N/A"},0,{"$f":"IF(AND(AG229=38,$AE$4>=75,$AE$4<=80,ModelNo=\"9001\"),\"Dbl.\"&AG229&\"G\",0)","v":{"$error":"#N/A"}}]
[null,null,null,null,null,null,null,null,null,null,null,null,null,null,null,null,null,null,null,null,null,null,null,null,null,null,{"$error":"#N/A"},{"$f":"IF(AND($AA$4<=40,$AA$4>38),40,0)","v":{"$error":"#N/A"}},{"$f":"IF(AND(AB230=40,$Z$4>=11,$Z$4<=16),AB230&\"A\",0)","v":{"$error":"#N/A"}},null,null,{"$error":"#N/A"},{"$f":"IF(AND($AF$4<=40,$AF$4>38),40,0)","v":0},{"$f":"IF(AND(AG230=40,$Z$4>=11,$Z$4<=16),AG230&\"A\",0)","v":{"$error":"#N/A"}}]
[null,null,null,null,null,null,null,null,null,null,null,null,null,null,null,null,null,null,null,null,null,null,null,null,null,null,{"$error":"#N/A"},{"$error":"#N/A"},{"$f":"IF(AND(AB231=40,$Z$4>=17,$Z$4<=22),AB231&\"B\",0)","v":{"$error":"#N/A"}},null,null,{"$error":"#N/A"},0,{"$f":"IF(AND(AG231=40,$Z$4>=17,$Z$4<=22),AG231&\"B\",0)","v":{"$error":"#N/A"}}]
[null,null,null,null,null,null,null,null,null,null,null,null,null,null,null,null,null,null,null,null,null,null,null,null,null,null,{"$error":"#N/A"},{"$error":"#N/A"},{"$f":"IF(AND(AB232=40,$Z$4>=23,$Z$4<=27),AB232&\"C\",0)","v":{"$error":"#N/A"}},null,null,{"$error":"#N/A"},0,{"$f":"IF(AND(AG232=40,$Z$4>=23,$Z$4<=27),AG232&\"C\",0)","v":{"$error":"#N/A"}}]
[null,null,null,null,null,null,null,null,null,null,null,null,null,null,null,null,null,null,null,null,null,null,null,null,null,null,{"$error":"#N/A"},{"$error":"#N/A"},{"$f":"IF(AND(AB233=40,$Z$4>=28,$Z$4<=32),AB233&\"D\",0)","v":{"$error":"#N/A"}},null,null,{"$error":"#N/A"},0,{"$f":"IF(AND(AG233=40,$Z$4>=28,$Z$4<=32),AG233&\"D\",0)","v":{"$error":"#N/A"}}]
[null,null,null,null,null,null,null,null,null,null,null,null,null,null,null,null,null,null,null,null,null,null,null,null,null,null,{"$error":"#N/A"},{"$error":"#N/A"},{"$f":"IF(AND(AB234=40,$Z$4>=33,$Z$4<=34),AB234&\"E\",0)","v":{"$error":"#N/A"}},null,null,{"$error":"#N/A"},0,{"$f":"IF(AND(AG234=40,$Z$4>=33,$Z$4<=34),AG234&\"E\",0)","v":{"$error":"#N/A"}}]
[null,null,null,null,null,null,null,null,null,null,null,null,null,null,null,null,null,null,null,null,null,null,null,null,null,null,{"$error":"#N/A"},{"$error":"#N/A"},{"$f":"IF(AND(AB235=40,$Z$4>=35,$Z$4<=37),AB235&\"F\",0)","v":{"$error":"#N/A"}},null,null,{"$error":"#N/A"},0,{"$f":"IF(AND(AG235=40,$Z$4>=35,$Z$4<=37),AG235&\"F\",0)","v":{"$error":"#N/A"}}]
[null,null,null,null,null,null,null,null,null,null,null,null,null,null,null,null,null,null,null,null,null,null,null,null,null,null,{"$error":"#N/A"},{"$error":"#N/A"},{"$f":"IF(AND(AB236=40,$Z$4>=38,$Z$4<=40),AB236&\"G\",0)","v":{"$error":"#N/A"}},null,null,{"$error":"#N/A"},0,{"$f":"IF(AND(AG236=40,$Z$4>=38,$Z$4<=40),AG236&\"G\",0)","v":{"$error":"#N/A"}}]
[null,null,null,null,null,null,null,null,null,null,null,null,null,null,null,null,null,null,null,null,null,null,null,null,null,null,{"$error":"#N/A"},{"$error":"#N/A"},{"$f":"IF(AND(AB237=40,$Z$4>=41,$Z$4<=43),AB237&\"H\",0)","v":{"$error":"#N/A"}},null,null,{"$error":"#N/A"},0,{"$f":"IF(AND(AG237=40,$Z$4>=41,$Z$4<=43),AG237&\"H\",0)","v":{"$error":"#N/A"}}]
[null,null,null,null,null,null,null,null,null,null,null,null,null,null,null,null,null,null,null,null,null,null,null,null,null,null,{"$error":"#N/A"},{"$error":"#N/A"},{"$f":"IF(AND(AB238=40,$Z$4>=44,$Z$4<=45),AB238&\"I\",0)","v":{"$error":"#N/A"}},null,null,{"$error":"#N/A"},0,{"$f":"IF(AND(AG238=40,$Z$4>=44,$Z$4<=45),AG238&\"I\",0)","v":{"$error":"#N/A"}}]
[null,null,null,null,null,null,null,null,null,null,null,null,null,null,null,null,null,null,null,null,null,null,null,null,null,null,{"$f":"IF(AND(AB239>0,AC239>0),AB239,0)","v":{"$error":"#N/A"}},{"$error":"#N/A"},{"$f":"IF(AND(AB239=40,$Z$4>=46,$Z$4<=54,ModelNo=\"9001\"),\"Dbl.\"&AB239&\"C\",0)","v":{"$error":"#N/A"}},null,null,{"$error":"#N/A"},0,{"$f":"IF(AND(AG239=40,$Z$4>=46,$Z$4<=54,ModelNo=\"9001\"),\"Dbl.\"&AG239&\"C\",0)","v":{"$error":"#N/A"}}]
[null,null,null,null,null,null,null,null,null,null,null,null,null,null,null,null,null,null,null,null,null,null,null,null,null,null,{"$error":"#N/A"},{"$error":"#N/A"},{"$f":"IF(AND(AB240=40,$Z$4>=55,$Z$4<=64,ModelNo=\"9001\"),\"Dbl.\"&AB240&\"D\",0)","v":{"$error":"#N/A"}},null,null,{"$error":"#N/A"},0,{"$f":"IF(AND(AG240=40,$Z$4>=55,$Z$4<=64,ModelNo=\"9001\"),\"Dbl.\"&AG240&\"D\",0)","v":{"$error":"#N/A"}}]
[null,null,null,null,null,null,null,null,null,null,null,null,null,null,null,null,null,null,null,null,null,null,null,null,null,null,{"$error":"#N/A"},{"$error":"#N/A"},{"$f":"IF(AND(AB241=40,$Z$4>=65,$Z$4<=68,ModelNo=\"9001\"),\"Dbl.\"&AB241&\"E\",0)","v":{"$error":"#N/A"}},null,null,{"$error":"#N/A"},0,{"$f":"IF(AND(AG241=40,$Z$4>=65,$Z$4<=68,ModelNo=\"9001\"),\"Dbl.\"&AG241&\"E\",0)","v":{"$error":"#N/A"}}]
[null,null,null,null,null,null,null,null,null,null,null,null,null,null,null,null,null,null,null,null,null,null,null,null,null,null,{"$error":"#N/A"},{"$error":"#N/A"},{"$f":"IF(AND(AB242=40,$Z$4>=69,$Z$4<=74,ModelNo=\"9001\"),\"Dbl.\"&AB242&\"F\",0)","v":{"$error":"#N/A"}},null,null,{"$error":"#N/A"},0,{"$f":"IF(AND(AG242=40,$Z$4>=69,$Z$4<=74,ModelNo=\"9001\"),\"Dbl.\"&AG242&\"F\",0)","v":{"$error":"#N/A"}}]
[null,null,null,null,null,null,null,null,null,null,null,null,null,null,null,null,null,null,null,null,null,null,null,null,null,null,{"$error":"#N/A"},{"$error":"#N/A"},{"$f":"IF(AND(AB243=40,$Z$4>=75,$Z$4<=80,ModelNo=\"9001\"),\"Dbl.\"&AB243&\"G\",0)","v":{"$error":"#N/A"}},null,null,{"$error":"#N/A"},0,{"$f":"IF(AND(AG243=40,$Z$4>=75,$Z$4<=80,ModelNo=\"9001\"),\"Dbl.\"&AG243&\"G\",0)","v":{"$error":"#N/A"}}]
[null,null,null,null,null,null,null,null,null,null,null,null,null,null,null,null,null,null,null,null,null,null,null,null,null,null,{"$error":"#N/A"},{"$f":"IF(AND($AA$4<=42,$AA$4>40),42,0)","v":{"$error":"#N/A"}},{"$f":"IF(AND(AB244=42,$Z$4>=11,$Z$4<=16),AB244&\"A\",0)","v":{"$error":"#N/A"}},null,null,{"$error":"#N/A"},{"$f":"IF(AND($AF$4<=42,$AF$4>40),42,0)","v":0},{"$f":"IF(AND(AG244=42,$Z$4>=11,$Z$4<=16),AG244&\"A\",0)","v":{"$error":"#N/A"}}]
[null,null,null,null,null,null,null,null,null,null,null,null,null,null,null,null,null,null,null,null,null,null,null,null,null,null,{"$error":"#N/A"},{"$error":"#N/A"},{"$f":"IF(AND(AB245=42,$Z$4>=17,$Z$4<=22),AB245&\"B\",0)","v":{"$error":"#N/A"}},null,null,{"$error":"#N/A"},0,{"$f":"IF(AND(AG245=42,$Z$4>=17,$Z$4<=22),AG245&\"B\",0)","v":{"$error":"#N/A"}}]
[null,null,null,null,null,null,null,null,null,null,null,null,null,null,null,null,null,null,null,null,null,null,null,null,null,null,{"$error":"#N/A"},{"$error":"#N/A"},{"$f":"IF(AND(AB246=42,$Z$4>=23,$Z$4<=27),AB246&\"C\",0)","v":{"$error":"#N/A"}},null,null,{"$error":"#N/A"},0,{"$f":"IF(AND(AG246=42,$Z$4>=23,$Z$4<=27),AG246&\"C\",0)","v":{"$error":"#N/A"}}]
[null,null,null,null,null,null,null,null,null,null,null,null,null,null,null,null,null,null,null,null,null,null,null,null,null,null,{"$error":"#N/A"},{"$error":"#N/A"},{"$f":"IF(AND(AB247=42,$Z$4>=28,$Z$4<=32),AB247&\"D\",0)","v":{"$error":"#N/A"}},null,null,{"$error":"#N/A"},0,{"$f":"IF(AND(AG247=42,$Z$4>=28,$Z$4<=32),AG247&\"D\",0)","v":{"$error":"#N/A"}}]
[null,null,null,null,null,null,null,null,null,null,null,null,null,null,null,null,null,null,null,null,null,null,null,null,null,null,{"$error":"#N/A"},{"$error":"#N/A"},{"$f":"IF(AND(AB248=42,$Z$4>=33,$Z$4<=34),AB248&\"E\",0)","v":{"$error":"#N/A"}},null,null,{"$error":"#N/A"},0,{"$f":"IF(AND(AG248=42,$Z$4>=33,$Z$4<=34),AG248&\"E\",0)","v":{"$error":"#N/A"}}]
[null,null,null,null,null,null,null,null,null,null,null,null,null,null,null,null,null,null,null,null,null,null,null,null,null,null,{"$error":"#N/A"},{"$error":"#N/A"},{"$f":"IF(AND(AB249=42,$Z$4>=35,$Z$4<=37),AB249&\"F\",0)","v":{"$error":"#N/A"}},null,null,{"$error":"#N/A"},0,{"$f":"IF(AND(AG249=42,$Z$4>=35,$Z$4<=37),AG249&\"F\",0)","v":{"$error":"#N/A"}}]
[null,null,null,null,null,null,null,null,null,null,null,null,null,null,null,null,null,null,null,null,null,null,null,null,null,null,{"$error":"#N/A"},{"$error":"#N/A"},{"$f":"IF(AND(AB250=42,$Z$4>=38,$Z$4<=40),AB250&\"G\",0)","v":{"$error":"#N/A"}},null,null,{"$error":"#N/A"},0,{"$f":"IF(AND(AG250=42,$Z$4>=38,$Z$4<=40),AG250&\"G\",0)","v":{"$error":"#N/A"}}]
[null,null,null,null,null,null,null,null,null,null,null,null,null,null,null,null,null,null,null,null,null,null,null,null,null,null,{"$error":"#N/A"},{"$error":"#N/A"},{"$f":"IF(AND(AB251=42,$Z$4>=41,$Z$4<=43),AB251&\"H\",0)","v":{"$error":"#N/A"}},null,null,{"$error":"#N/A"},0,{"$f":"IF(AND(AG251=42,$Z$4>=41,$Z$4<=43),AG251&\"H\",0)","v":{"$error":"#N/A"}}]
[null,null,null,null,null,null,null,null,null,null,null,null,null,null,null,null,null,null,null,null,null,null,null,null,null,null,{"$error":"#N/A"},{"$error":"#N/A"},{"$f":"IF(AND(AB252=42,$Z$4>=44,$Z$4<=45),AB252&\"I\",0)","v":{"$error":"#N/A"}},null,null,{"$error":"#N/A"},0,{"$f":"IF(AND(AG252=42,$Z$4>=44,$Z$4<=45),AG252&\"I\",0)","v":{"$error":"#N/A"}}]
[null,null,null,null,null,null,null,null,null,null,null,null,null,null,null,null,null,null,null,null,null,null,null,null,null,null,{"$error":"#N/A"},{"$error":"#N/A"},{"$f":"IF(AND(AB253=42,$Z$4>=46,$Z$4<=54,ModelNo=\"9001\"),\"Dbl.\"&AB253&\"C\",0)","v":{"$error":"#N/A"}},null,null,{"$error":"#N/A"},0,{"$f":"IF(AND(AG253=42,$Z$4>=46,$Z$4<=54,ModelNo=\"9001\"),\"Dbl.\"&AG253&\"C\",0)","v":{"$error":"#N/A"}}]
[null,null,null,null,null,null,null,null,null,null,null,null,null,null,null,null,null,null,null,null,null,null,null,null,null,null,{"$error":"#N/A"},{"$error":"#N/A"},{"$f":"IF(AND(AB254=42,$Z$4>=55,$Z$4<=64,ModelNo=\"9001\"),\"Dbl.\"&AB254&\"D\",0)","v":{"$error":"#N/A"}},null,null,{"$error":"#N/A"},0,{"$f":"IF(AND(AG254=42,$Z$4>=55,$Z$4<=64,ModelNo=\"9001\"),\"Dbl.\"&AG254&\"D\",0)","v":{"$error":"#N/A"}}]
[null,null,null,null,null,null,null,null,null,null,null,null,null,null,null,null,null,null,null,null,null,null,null,null,null,null,{"$error":"#N/A"},{"$error":"#N/A"},{"$f":"IF(AND(AB255=42,$Z$4>=65,$Z$4<=68,ModelNo=\"9001\"),\"Dbl.\"&AB255&\"E\",0)","v":{"$error":"#N/A"}},null,null,{"$error":"#N/A"},0,{"$f":"IF(AND(AG255=42,$Z$4>=65,$Z$4<=68,ModelNo=\"9001\"),\"Dbl.\"&AG255&\"E\",0)","v":{"$error":"#N/A"}}]
[null,null,null,null,null,null,null,null,null,null,null,null,null,null,null,null,null,null,null,null,null,null,null,null,null,null,{"$error":"#N/A"},{"$error":"#N/A"},{"$f":"IF(AND(AB256=42,$Z$4>=69,$Z$4<=74,ModelNo=\"9001\"),\"Dbl.\"&AB256&\"F\",0)","v":{"$error":"#N/A"}},null,null,{"$error":"#N/A"},0,{"$f":"IF(AND(AG256=42,$Z$4>=69,$Z$4<=74,ModelNo=\"9001\"),\"Dbl.\"&AG256&\"F\",0)","v":{"$error":"#N/A"}}]
[null,null,null,null,null,null,null,null,null,null,null,null,null,null,null,null,null,null,null,null,null,null,null,null,null,null,{"$error":"#N/A"},{"$error":"#N/A"},{"$f":"IF(AND(AB257=42,$Z$4>=75,$Z$4<=80,ModelNo=\"9001\"),\"Dbl.\"&AB257&\"G\",0)","v":{"$error":"#N/A"}},null,null,{"$error":"#N/A"},0,{"$f":"IF(AND(AG257=42,$Z$4>=75,$Z$4<=80,ModelNo=\"9001\"),\"Dbl.\"&AG257&\"G\",0)","v":{"$error":"#N/A"}}]
[null,null,null,null,null,null,null,null,null,null,null,null,null,null,null,null,null,null,null,null,null,null,null,null,null,null,{"$error":"#N/A"},{"$f":"IF(AND($AA$4<=44,$AA$4>42),44,0)","v":{"$error":"#N/A"}},{"$f":"IF(AND(AB258=44,$Z$4>=11,$Z$4<=16),AB258&\"A\",0)","v":{"$error":"#N/A"}},null,null,{"$error":"#N/A"},{"$f":"IF(AND($AF$4<=44,$AF$4>42),44,0)","v":0},{"$f":"IF(AND(AG258=44,$Z$4>=11,$Z$4<=16),AG258&\"A\",0)","v":{"$error":"#N/A"}}]
[null,null,null,null,null,null,null,null,null,null,null,null,null,null,null,null,null,null,null,null,null,null,null,null,null,null,{"$error":"#N/A"},{"$error":"#N/A"},{"$f":"IF(AND(AB259=44,$Z$4>=17,$Z$4<=22),AB259&\"B\",0)","v":{"$error":"#N/A"}},null,null,{"$error":"#N/A"},0,{"$f":"IF(AND(AG259=44,$Z$4>=17,$Z$4<=22),AG259&\"B\",0)","v":{"$error":"#N/A"}}]
[null,null,null,null,null,null,null,null,null,null,null,null,null,null,null,null,null,null,null,null,null,null,null,null,null,null,{"$error":"#N/A"},{"$error":"#N/A"},{"$f":"IF(AND(AB260=44,$Z$4>=23,$Z$4<=27),AB260&\"C\",0)","v":{"$error":"#N/A"}},null,null,{"$error":"#N/A"},0,{"$f":"IF(AND(AG260=44,$Z$4>=23,$Z$4<=27),AG260&\"C\",0)","v":{"$error":"#N/A"}}]
[null,null,null,null,null,null,null,null,null,null,null,null,null,null,null,null,null,null,null,null,null,null,null,null,null,null,{"$error":"#N/A"},{"$error":"#N/A"},{"$f":"IF(AND(AB261=44,$Z$4>=28,$Z$4<=32),AB261&\"D\",0)","v":{"$error":"#N/A"}},null,null,{"$f":"IF(AND(AG261>0,AH261>0),AG261,0)","v":{"$error":"#N/A"}},0,{"$f":"IF(AND(AG261=44,$Z$4>=28,$Z$4<=32),AG261&\"D\",0)","v":{"$error":"#N/A"}}]
[null,null,null,null,null,null,null,null,null,null,null,null,null,null,null,null,null,null,null,null,null,null,null,null,null,null,{"$error":"#N/A"},{"$error":"#N/A"},{"$f":"IF(AND(AB262=44,$Z$4>=33,$Z$4<=34),AB262&\"E\",0)","v":{"$error":"#N/A"}},null,null,{"$error":"#N/A"},0,{"$f":"IF(AND(AG262=44,$Z$4>=33,$Z$4<=34),AG262&\"E\",0)","v":{"$error":"#N/A"}}]
[null,null,null,null,null,null,null,null,null,null,null,null,null,null,null,null,null,null,null,null,null,null,null,null,null,null,{"$error":"#N/A"},{"$error":"#N/A"},{"$f":"IF(AND(AB263=44,$Z$4>=35,$Z$4<=37),AB263&\"F\",0)","v":{"$error":"#N/A"}},null,null,{"$error":"#N/A"},0,{"$f":"IF(AND(AG263=44,$Z$4>=35,$Z$4<=37),AG263&\"F\",0)","v":{"$error":"#N/A"}}]
[null,null,null,null,null,null,null,null,null,null,null,null,null,null,null,null,null,null,null,null,null,null,null,null,null,null,{"$error":"#N/A"},{"$error":"#N/A"},{"$f":"IF(AND(AB264=44,$Z$4>=38,$Z$4<=40),AB264&\"G\",0)","v":{"$error":"#N/A"}},null,null,{"$error":"#N/A"},0,{"$f":"IF(AND(AG264=44,$Z$4>=38,$Z$4<=40),AG264&\"G\",0)","v":{"$error":"#N/A"}}]
[null,null,null,null,null,null,null,null,null,null,null,null,null,null,null,null,null,null,null,null,null,null,null,null,null,null,{"$error":"#N/A"},{"$error":"#N/A"},{"$f":"IF(AND(AB265=44,$Z$4>=41,$Z$4<=43),AB265&\"H\",0)","v":{"$error":"#N/A"}},null,null,{"$error":"#N/A"},0,{"$f":"IF(AND(AG265=44,$Z$4>=41,$Z$4<=43),AG265&\"H\",0)","v":{"$error":"#N/A"}}]
[null,null,null,null,null,null,null,null,null,null,null,null,null,null,null,null,null,null,null,null,null,null,null,null,null,null,{"$error":"#N/A"},{"$error":"#N/A"},{"$f":"IF(AND(AB266=44,$Z$4>=44,$Z$4<=45),AB266&\"I\",0)","v":{"$error":"#N/A"}},null,null,{"$error":"#N/A"},0,{"$f":"IF(AND(AG266=44,$Z$4>=44,$Z$4<=45),AG266&\"I\",0)","v":{"$error":"#N/A"}}]
[null,null,null,null,null,null,null,null,null,null,null,null,null,null,null,null,null,null,null,null,null,null,null,null,null,null,{"$error":"#N/A"},{"$error":"#N/A"},{"$f":"IF(AND(AB267=44,$Z$4>=46,$Z$4<=54,ModelNo=\"9001\"),\"Dbl.\"&AB267&\"C\",0)","v":{"$error":"#N/A"}},null,null,{"$error":"#N/A"},0,{"$f":"IF(AND(AG267=44,$Z$4>=46,$Z$4<=54,ModelNo=\"9001\"),\"Dbl.\"&AG267&\"C\",0)","v":{"$error":"#N/A"}}]
[null,null,null,null,null,null,null,null,null,null,null,null,null,null,null,null,null,null,null,null,null,null,null,null,null,null,{"$error":"#N/A"},{"$error":"#N/A"},{"$f":"IF(AND(AB268=44,$Z$4>=55,$Z$4<=64,ModelNo=\"9001\"),\"Dbl.\"&AB268&\"D\",0)","v":{"$error":"#N/A"}},null,null,{"$error":"#N/A"},0,{"$f":"IF(AND(AG268=44,$Z$4>=55,$Z$4<=64,ModelNo=\"9001\"),\"Dbl.\"&AG268&\"D\",0)","v":{"$error":"#N/A"}}]
[null,null,null,null,null,null,null,null,null,null,null,null,null,null,null,null,null,null,null,null,null,null,null,null,null,null,{"$error":"#N/A"},{"$error":"#N/A"},{"$f":"IF(AND(AB269=44,$Z$4>=65,$Z$4<=68,ModelNo=\"9001\"),\"Dbl.\"&AB269&\"E\",0)","v":{"$error":"#N/A"}},null,null,{"$error":"#N/A"},0,{"$f":"IF(AND(AG269=44,$Z$4>=65,$Z$4<=68,ModelNo=\"9001\"),\"Dbl.\"&AG269&\"E\",0)","v":{"$error":"#N/A"}}]
[null,null,null,null,null,null,null,null,null,null,null,null,null,null,null,null,null,null,null,null,null,null,null,null,null,null,{"$error":"#N/A"},{"$error":"#N/A"},{"$f":"IF(AND(AB270=44,$Z$4>=69,$Z$4<=74,ModelNo=\"9001\"),\"Dbl.\"&AB270&\"F\",0)","v":{"$error":"#N/A"}},null,null,{"$error":"#N/A"},0,{"$f":"IF(AND(AG270=44,$Z$4>=69,$Z$4<=74,ModelNo=\"9001\"),\"Dbl.\"&AG270&\"F\",0)","v":{"$error":"#N/A"}}]
[null,null,null,null,null,null,null,null,null,null,null,null,null,null,null,null,null,null,null,null,null,null,null,null,null,null,{"$error":"#N/A"},{"$error":"#N/A"},{"$f":"IF(AND(AB271=44,$Z$4>=75,$Z$4<=80,ModelNo=\"9001\"),\"Dbl.\"&AB271&\"G\",0)","v":{"$error":"#N/A"}},null,null,{"$error":"#N/A"},0,{"$f":"IF(AND(AG271=44,$Z$4>=75,$Z$4<=80,ModelNo=\"9001\"),\"Dbl.\"&AG271&\"G\",0)","v":{"$error":"#N/A"}}]

{"sheet":"Data","index":2,"n_rows":405,"n_cols":43,"rows_kept":405,"cut":false,"hidden":true,"merged":[]}
[null,"Model","Description","Value"]
[{"$f":"IF(ModelNo=B2,1,\"\")","v":""},"9051","Sash Width",{"$f":"Frame_Width-1.625","v":-1.625},null,{"$f":"G62","v":"Select a Model"},"Models","Description","W cut-back","H-cut-back","Width","Height","Min W","Min H","Max W","Max H","Max UI","Type1","Type2","Type3","Type4","Screen1","Screen2","Screen3","Glass Thickness","Glass","Opening",null,null,null,null,null,null,null,null,null,null,null,"Triple IG calculation"]
[{"$f":"IF(ModelNo=B3,2,\"\")","v":""},"9051","Sash Height",{"$f":"Frame_Height-1.625","v":-1.625},null,1,"Select a Model"]
[{"$f":"IF(ModelNo=B4,3,\"\")","v":""},"9051","Sash Glass Width",{"$f":"Frame_Width-4.625","v":-4.625},null,2,"3001","Reserve Double Hung",0,0,null,null,12,20,{"$f":"IF(REINFSELECT=2,48,IF(REINFSELECT=3,52,\"\"))","v":""},{"$f":"IF(REINFSELECT=2,84,IF(REINFSELECT=3,96,\"\"))","v":""},{"$f":"IF(REINFSELECT=2,126,IF(REINFSELECT=3,148,\"\"))","v":""},"Standard","Oriel (2/3 - 1/3)","Cottage (1/3 - 2/3)","Custom","Half","Full","Locking",5,null,{"$f":"IF(RO=2,\"<< Exact Size Only\",\"\")","v":""},null,null,null,null,null,null,null,null,null,null,null,"SS (2.2)","DS (3.2)","4 mm","TS (5.0)"]
[{"$f":"IF(ModelNo=B5,4,\"\")","v":""},"9051","Sash Glass Height",{"$f":"Frame_Height-4.625","v":-4.625},null,3,"3002","Reserve Two Lite Slider",0,0,null,null,18.5,11.25,{"$f":"IF(REINFSELECT=2,72,IF(REINFSELECT=3,84,\"\"))","v":""},{"$f":"IF(REINFSELECT=2,56,IF(REINFSELECT=3,72,\"\"))","v":""},{"$f":"IF(REINFSELECT=2,128,IF(REINFSELECT=3,156,\"\"))","v":""},"Standard",null,null,null,"Half","Full",null,5,null,{"$f":"IF(RO=2,\"<< Exact Size Only\",\"\")","v":""},null,null,null,null,1,"Single Strength (2.5 mm)",null,null,null,null,"Max. Short",{"$f":"IF(TG2W>41,0,41)","v":0},{"$f":"IF(TG2W>56,0,56)","v":0},{"$f":"IF(TG2W>67,0,67)","v":0},{"$f":"IF(TG2W>70,0,70)","v":0},"Annealed"]
[{"$f":"IF(ModelNo=B6,5,\"\")","v":""},"9051","Glass Area (sq.ft.)",{"$f":"(D4*D5)/144","v":0.14854600694444445},null,4,"3003","Reserve Three Lite Slider (1/4-1/2-1/4)",0,0,null,null,47.5,11.25,{"$f":"IF(REINFSELECT=2,108,IF(REINFSELECT=3,120,\"\"))","v":""},{"$f":"IF(REINFSELECT=2,56,IF(REINFSELECT=3,72,\"\"))","v":""},{"$f":"IF(REINFSELECT=2,164,IF(REINFSELECT=3,192,\"\"))","v":""},"Standard (1/4-1/2-1/4)",null,null,null,"Half","Full",null,5,null,{"$f":"IF(RO=2,\"<< Exact Size Only\",\"\")","v":""},null,null,null,null,2,"Double Strength (3 mm)",null,null,null,null,"Max. Long",{"$f":"IF(TG2H>62,0,62)","v":0},{"$f":"IF(TG2H>76,0,76)","v":0},{"$f":"IF(TG2H>90,0,90)","v":0},{"$f":"IF(TG2H>102,0,102)","v":0},"Annealed"]
[{"$f":"IF(ModelNo=B7,6,\"\")","v":""},"9051","Screen Width",{"$f":"Frame_Width-4","v":-4},null,5,"3004","Reserve Picture Window",0,0,null,null,9.5,9.5,112,96,154,"Standard",null,null,null,null,null,null,5,null,{"$f":"IF(RO=2,\"<< Exact Size Only\",\"\")","v":""},null,null,null,null,3,"Triple Strength (5 mm)",null,null,null,null,"Max Sq.Ft.",{"$f":"IF(TG2A>12,0,12)","v":0},{"$f":"IF(TG2A>22,0,22)","v":0},{"$f":"IF(TG2A>32,0,32)","v":0},{"$f":"IF(TG2A>35,0,35)","v":0},"Annealed"]
[{"$f":"IF(ModelNo=B8,7,\"\")","v":""},"9051","Screen Height",{"$f":"Frame_Height-4","v":-4},null,6,"3009","Reserve Three Lite Slider Equal Lite",0,0,null,null,37.25,11.25,{"$f":"IF(REINFSELECT=2,108,IF(REINFSELECT=3,120,\"\"))","v":""},{"$f":"IF(REINFSELECT=2,56,IF(REINFSELECT=3,72,\"\"))","v":""},{"$f":"IF(REINFSELECT=2,164,IF(REINFSELECT=3,192,\"\"))","v":""},"Standard (1/3-1/3-1/3)",null,null,null,"Half","Full",null,5,null,{"$f":"IF(RO=2,\"<< Exact Size Only\",\"\")","v":""},null,null,null,null,4,"Laminated",null,null,null,null,"Max. Short",0,{"$f":"IF(TG2W>42,0,42)","v":0},{"$f":"IF(TG2W>70,0,70)","v":0},{"$f":"IF(TG2W>70,0,70)","v":0},"Tempered"]
[{"$f":"IF(ModelNo=B9,8,\"\")","v":""},"9051","Awning Does not Meet Egress",null,null,7,"9001","Preservation Double Hung",0,0,null,null,16,26,52,84,136,"Standard","Oriel (2/3 - 1/3)","Cottage (1/3 - 2/3)","Custom","Half","Full","Locking",5,null,{"$f":"IF(RO=2,\"<< Exact Size Only\",\"\")","v":""},null,null,null,null,5,"Triple IG Single Strength",null,null,null,null,"Max. Long",0,{"$f":"IF(TG2H>84,0,84)","v":0},{"$f":"IF(TG2H>129,0,129)","v":0},{"$f":"IF(TG2H>129,0,129)","v":0},"Tempered"]
[{"$f":"IF(ModelNo=B10,1,\"\")","v":""},"9052","Operating Sash Width",{"$f":"Frame_Width-1.625","v":-1.625},null,8,"9002","Preservation Two Lite Slider",0,0,null,null,25.25,16.625,84,68,148,"Standard",null,null,null,"Half","Full",null,5,null,"",null,null,null,null,6,"Triple IG Double Strength",null,null,null,null,"Max Sq.Ft.",0,{"$f":"IF(TG2A>24.5,0,24.5)","v":0},{"$f":"IF(TG2A>42,0,42)","v":0},{"$f":"IF(TG2A>42,0,42)","v":0},"Tempered"]
[{"$f":"IF(ModelNo=B11,2,\"\")","v":""},"9052","Operating Sash Height",{"$f":"(Frame_Height/2)-1.375","v":-1.375},null,9,"9003","Preservation Three Lite Slider (1/4-1/2-1/4)",0,0,null,null,44.5,16.625,120,68,184,"Standard (1/4-1/2-1/4)",null,null,null,"Half","Full",null,5,null,"",null,null,null,null,null,null,null,null,null,null,null,{"$f":"IF(AND(AM5>0,AM6>0,AM7>0),1,0)","v":0},{"$f":"IF(AND(AN5>0,AN6>0,AN7>0),1,0)","v":0},{"$f":"IF(AND(AO5>0,AO6>0,AO7>0),1,0)","v":0},{"$f":"IF(AND(AP5>0,AP6>0,AP7>0),1,0)","v":0},{"$f":"IF(AM11>0,\"≥SS Annealed\",IF(AN11>0,\"≥DS Annealed\",IF(AP11>0,\"TS Annealed\",\"\")))","v":""}]
[{"$f":"IF(ModelNo=B12,3,\"\")","v":""},"9052","Fixed Sash Width",{"$f":"Frame_Width-1.625","v":-1.625},null,10,"9009","Preservation Three Lite Slider Equal Lite",0,0,null,null,35.5,16.625,120,68,184,"Standard (1/3-1/3-1/3)",null,null,null,"Half","Full",null,5,null,"",null,null,null,null,null,null,null,null,null,null,null,null,{"$f":"IF(AND(AN8>0,AN9>0,AN10>0),1,0)","v":0},{"$f":"IF(AND(AO8>0,AO9>0,AO10>0),1,0)","v":0},{"$f":"IF(AND(AP8>0,AP9>0,AP10>0),1,0)","v":0},{"$f":"IF(AN12>0,\"≥DS Tempered\",IF(AP12>0,\"TS Tempered\",\"\"))","v":""}]
[{"$f":"IF(ModelNo=B13,4,\"\")","v":""},"9052","Fixed Sash Height",{"$f":"(Frame_Height/2)-1.375","v":-1.375},null,11,"9014","Preservation Picture Window",0,0,null,null,13,13,96,84,154,"Standard",null,null,null,null,null,null,5,null,"",null,null,null,null,null,null,null,null,null,null,null,"2.5 mm","3.2 mm","4 mm","5 mm"]
[{"$f":"IF(ModelNo=B14,5,\"\")","v":""},"9052","Operating Sash Glass Width",{"$f":"Frame_Width-4.625","v":-4.625},null,12,"9022","Preservation Two Lite Swign & Clean",0,0,null,null,30,20,72,60,120,"Standard",null,null,null,"Half","Full",null,5,null,"",null,null,null,null,null,null,null,null,null,null,"Max. Short",{"$f":"IF(TG2H>41,0,41)","v":0},{"$f":"IF(TG2H>56,0,56)","v":0},{"$f":"IF(TG2H>67,0,67)","v":0},{"$f":"IF(TG2H>70,0,70)","v":0},"Annealed"]
[{"$f":"IF(ModelNo=B15,6,\"\")","v":""},"9052","Operating Sash Glass Height",{"$f":"Frame_Height/2-4.375","v":-4.375},null,13,"9023","Preservation Three Lite Swign & Clean (1/4-1/2-1/4)",0,0,null,null,48,20,84,60,144,"Standard (1/4-1/2-1/4)",null,null,null,"Half","Full",null,5,null,"",null,null,null,null,null,null,null,null,null,null,"Max. Long",{"$f":"IF(TG2W>62,0,62)","v":0},{"$f":"IF(TG2W>76,0,76)","v":0},{"$f":"IF(TG2W>90,0,90)","v":0},{"$f":"IF(TG2W>102,0,102)","v":0},"Annealed"]
[{"$f":"IF(ModelNo=B16,7,\"\")","v":""},"9052","Fixed Sash Glass Width",{"$f":"Frame_Width-4.625","v":-4.625},null,14,"9029","Preservation Three Lite Swign & Clean Equal Lite",0,0,null,null,48,20,96,60,144,"Standard (1/3-1/3-1/3)",null,null,null,"Half","Full",null,5,null,"",null,null,null,null,null,null,null,null,null,null,"Max Sq.Ft.",{"$f":"IF(TG2A>12,0,12)","v":0},{"$f":"IF(TG2A>22,0,22)","v":0},{"$f":"IF(TG2A>32,0,32)","v":0},{"$f":"IF(TG2A>35,0,35)","v":0},"Annealed"]
[{"$f":"IF(ModelNo=B17,8,\"\")","v":""},"9052","Fixed Sash Glass Height",{"$f":"Frame_Height/2-4.375","v":-4.375},null,15,"9051","Preservation Single Vent Awning",0,0,null,null,19,16,48,48,96,"Standard",null,null,null,null,"Full",null,5,null,"",null,null,null,null,null,null,null,null,null,null,"Max. Short",0,{"$f":"IF(TG2H>42,0,42)","v":0},{"$f":"IF(TG2H>70,0,70)","v":0},{"$f":"IF(TG2H>70,0,70)","v":0},"Tempered"]
[{"$f":"IF(ModelNo=B18,9,\"\")","v":""},"9052","Screen Width",{"$f":"Frame_Width-4","v":-4},null,16,"9052","Preservation Awning W/ Transom Equal Lite",0,0,null,null,19,32,48,96,144,"Standard",null,null,null,"Half",null,null,5,null,"",null,null,null,null,null,null,null,null,null,null,"Max. Long",0,{"$f":"IF(TG2W>84,0,84)","v":0},{"$f":"IF(TG2W>129,0,129)","v":0},{"$f":"IF(TG2W>129,0,129)","v":0},"Tempered"]
[{"$f":"IF(ModelNo=B19,10,\"\")","v":""},"9052","Screen Height",{"$f":"(Frame_Height/2)-3.6875","v":-3.6875},null,17,"9053","Preservation Awning W/ Transom (1/3-2/3)",0,0,null,null,19,48,48,96,144,"Standard",null,null,null,"Half",null,null,5,null,"",null,null,null,null,null,null,null,null,null,null,"Max Sq.Ft.",0,{"$f":"IF(TG2A>24.5,0,24.5)","v":0},{"$f":"IF(TG2A>42,0,42)","v":0},{"$f":"IF(TG2A>42,0,42)","v":0},"Tempered"]
[{"$f":"IF(ModelNo=B20,11,\"\")","v":""},"9052","Awning Does not Meet Egress",null,null,18,"9054","Preservation Single Vent Awning W/ Bottom Transom",0,0,null,null,19,32,48,96,144,"Standard",null,null,null,"Half",null,null,5,null,"",null,null,null,null,null,null,null,null,null,null,null,{"$f":"IF(AND(AM14>0,AM15>0,AM16>0),1,0)","v":0},{"$f":"IF(AND(AN14>0,AN15>0,AN16>0),1,0)","v":0},{"$f":"IF(AND(AO14>0,AO15>0,AO16>0),1,0)","v":0},{"$f":"IF(AND(AP14>0,AP15>0,AP16>0),1,0)","v":0},{"$f":"IF(AM20>0,\"≥SS Annealed\",IF(AN20>0,\"≥DS Annealed\",IF(AP20>0,\"TS Annealed\",\"\")))","v":""}]
[{"$f":"IF(ModelNo=B21,1,\"\")","v":""},"9053","Operating Sash Width",{"$f":"Frame_Width-1.625","v":-1.625},null,19,"9055","Preservation Dual Vent Awning Equal Lite",0,0,null,null,19,32,48,96,144,"Standard",null,null,null,"Half",null,null,5,null,"",null,null,null,null,null,null,null,null,null,null,null,null,{"$f":"IF(AND(AN17>0,AN18>0,AN19>0),1,0)","v":0},{"$f":"IF(AND(AO17>0,AO18>0,AO19>0),1,0)","v":0},{"$f":"IF(AND(AP17>0,AP18>0,AP19>0),1,0)","v":0},{"$f":"IF(AN21>0,\"≥DS Tempered\",IF(AP21>0,\"TS Tempered\",\"\"))","v":""}]
[{"$f":"IF(ModelNo=B22,2,\"\")","v":""},"9053","Operating Sash Height",{"$f":"(Frame_Height/3)-1.375","v":-1.375},null,20,"9070","Preservation Picture Window",0,0,null,null,13,13,96,84,154,"Standard",null,null,null,null,null,null,5,null,"",null,null,null,null,null,null,null,null,null,null,{"$f":"IF(AND(OR(AQ11=\"≥SS Annealed\",AQ11=\"≥DS Annealed\",AQ12=\"≥DS Tempered\",AQ20=\"≥SS Annealed\",AQ20=\"≥DS Annealed\",AQ21=\"≥DS Tempered\")),\"TIG\",\"\")","v":""},{"$f":"IF(AND(ANNEALED1=0,ANNEALED2=0,OR(TEMPERED1>0,TEMPERED2>0)),\"Tempered is Required for TIG\",\"\")","v":""}]
[{"$f":"IF(ModelNo=B23,3,\"\")","v":""},"9053","Fixed Sash Width",{"$f":"Frame_Width-1.625","v":-1.625},null,21,"9071","Preservation Single Vent Casement",0,0,null,null,16,19,36,78,114,"Standard",null,null,null,null,"Full",null,5,null,"",null,null,null,null,null,null,null,null,null,null,"Model","Width","Height","Area","Balance"]
[{"$f":"IF(ModelNo=B24,4,\"\")","v":""},"9053","Fixed Sash Height",{"$f":"(2*(Frame_Height/3)-1.375)","v":-1.375},null,22,"9072","Preservation Dual Vent Casement",0,0,null,null,32,19,72,78,150,"Standard",null,null,null,"Half",null,null,5,null,"",null,null,null,null,null,null,null,null,null,{"$f":"IF(ModelNo=AL24,ModelNo,0)","v":0},"3001",{"$f":"MAX($D$352,$D$354)","v":-4.75},{"$f":"MAX($D$353,$D$355)","v":-2.21875},{"$f":"(AM24*AN24)/144","v":7.3187934027777776E-2},{"$f":"IF(AND(OR(Glass=5,Glass=6),OR(TOP_TUBE=0,BTM_TUBE=0)),1,IF(AND(Glass=3,Single_ST=0),1,0))","v":{"$error":"#N/A"}}]
[{"$f":"IF(ModelNo=B25,5,\"\")","v":""},"9053","Operating Sash Glass Width",{"$f":"Frame_Width-4.625","v":-4.625},null,23,"9073","Preservation Dual Vent Three Lite Casement (1/4-1/2-1/4)",0,0,null,null,64,19,120,78,198,"Standard (1/4-1/2-1/4)",null,null,null,"Half",null,null,5,null,"",null,null,null,null,null,null,null,null,null,{"$f":"IF(ModelNo=AL26,ModelNo,0)","v":0},"9001",{"$f":"MAX($D$145,$D$147)","v":-6.71875},{"$f":"MAX($D$146,$D$148)","v":-3.96875},{"$f":"(AM25*AN25)/144","v":0.18517388237847221},{"$f":"IF(ISERROR(OR($D$152,$D$154)),0,IF(AND(OR(Glass=5,Glass=6),OR($D$152=0,$D$154=0)),1,0))","v":0}]
[{"$f":"IF(ModelNo=B26,6,\"\")","v":""},"9053","Operating Sash Glass Height",{"$f":"Frame_Height/3-4.375","v":-4.375},null,24,"9074","Preservation Four Lite Casement",0,0,null,null,64,19,120,78,198,"Standard",null,null,null,"Half",null,null,5,null,"",null,null,null,null,null,null,null,null,null,0,"9002",{"$f":"$D$161","v":-3.75},{"$f":"$D$162","v":-7.4375},{"$f":"(AM26*AN26)/144","v":0.19368489583333334}]
[{"$f":"IF(ModelNo=B27,7,\"\")","v":""},"9053","Fixed Sash Glass Width",{"$f":"Frame_Width-4.625","v":-4.625},null,25,"9075","Preservation Five Lite Casement",0,0,null,null,80,19,120,78,198,"Standard",null,null,null,"Half",null,null,5,null,"",null,null,null,null,null,null,null,null,null,0,"9003",{"$f":"MAX($D$173,$D$175)","v":-2.25},{"$f":"MAX($D$174,$D$176)","v":-7.4375},{"$f":"(AM27*AN27)/144","v":0.1162109375}]
[{"$f":"IF(ModelNo=B28,8,\"\")","v":""},"9053","Fixed Sash Glass Height",{"$f":"2*(Frame_Height/3)-4.375","v":-4.375},null,26,"9079","Preservation Dual Vent Three Lite Casement (Equal Lite)",0,0,null,null,48,19,108,78,186,"Standard (1/3-1/3-1/3)",null,null,null,"Half",null,null,5,null,"",null,null,null,null,null,null,null,null,null,0,"9009",{"$f":"MAX($D$187,$D$189)","v":-2.9375},{"$f":"MAX($D$188,$D$190)","v":-7.4375},0.15171983506944445]
[{"$f":"IF(ModelNo=B29,9,\"\")","v":""},"9053","Screen Width",{"$f":"Frame_Width-4","v":-4},null,27,"9102","9100 Custom Two Lite Patio Door",0,0,null,null,48,72,96,96,180,null,null,null,null,"Half",null,null,5,null,"",null,null,null,null,null,null,null,null,null,0,"9014",{"$f":"$D$50","v":-4.625},{"$f":"$D$51","v":-4.625},0.14854600694444445]
[{"$f":"IF(ModelNo=B30,10,\"\")","v":""},"9053","Screen Height",{"$f":"(Frame_Height/3)-3.6875","v":-3.6875},null,28,"9103","9100 Custom Three Lite Patio Door",0,0,null,null,84,72,144,96,228,null,null,null,null,"Half",null,null,5,null,"",null,null,null,null,null,null,null,null,null,0,"9022",{"$f":"MAX($D$200,$D$202)","v":-4.125},{"$f":"MAX($D$201,$D$203)","v":-6.71875},0.19246419270833334]
[{"$f":"IF(ModelNo=B31,11,\"\")","v":""},"9053","Awning Does not Meet Egress",null,null,29,"9104","9100 Custom Four Lite Patio Door",0,0,null,null,96,72,144,96,240,null,null,null,null,"Half",null,null,5,null,"",null,null,null,null,null,null,null,null,null,0,"9023",{"$f":"MAX($D$213,$D$215)","v":-2.4375},{"$f":"MAX($D$214,$D$216)","v":-6.71875},0.11372884114583333]
[{"$f":"IF(ModelNo=B32,1,\"\")","v":""},"9054","Operating Sash Width",{"$f":"Frame_Width-1.625","v":-1.625},null,30,"9105","9100 Five Foot Two Lite Patio Door",1.375,0.5,60,80,58.625,79.5,58.625,79.5,139,"Standard",null,null,null,"Half",null,null,5,null,{"$f":"IF(RO=1,\"<< Rough Opening Only\",\"\")","v":"<< Rough Opening Only"},null,null,null,null,null,null,null,null,null,0,"9029",{"$f":"MAX($D$226,$D$228)","v":-3.21875},{"$f":"MAX($D$227,$D$229)","v":-6.71875},0.1501803927951389]
[{"$f":"IF(ModelNo=B33,2,\"\")","v":""},"9054","Operating Sash Height",{"$f":"(Frame_Height/2)-1.375","v":-1.375},null,31,"9106","9100 Six Foot Two Lite Patio Door",1.375,0.5,72,80,70.625,79.5,70.625,79.5,151,"Standard",null,null,null,"Half",null,null,5,null,"<< Rough Opening Only",null,null,null,null,null,null,null,null,null,0,"9051",{"$f":"$D$4","v":-4.625},{"$f":"$D$5","v":-4.625},0.14854600694444445]
[{"$f":"IF(ModelNo=B34,3,\"\")","v":""},"9054","Fixed Sash Width",{"$f":"Frame_Width-1.625","v":-1.625},null,32,"9108","9100 Eight Foot Two Lite Patio Door",1.75,0.5,96,80,94.25,79.5,94.25,79.5,175,"Standard",null,null,null,"Half",null,null,5,null,"<< Rough Opening Only",null,null,null,null,null,null,null,null,null,0,"9052",{"$f":"MAX($D$14,$D$16)","v":-4.625},{"$f":"MAX($D$15,$D$17)","v":-4.375},0.14051649305555555]
[{"$f":"IF(ModelNo=B35,4,\"\")","v":""},"9054","Fixed Sash Height",{"$f":"(Frame_Height/2)-1.375","v":-1.375},null,33,"9109","9100 Nine Foot Three Lite Patio Door",2.5,0.5,108,80,105.5,79.5,105.5,79.5,186,"Standard",null,null,null,"Half",null,null,5,null,"<< Rough Opening Only",null,null,null,null,null,null,null,null,null,0,"9053",{"$f":"MAX($D$25,$D$27)","v":-4.625},{"$f":"MAX($D$26,$D$28)","v":-4.375},0.14051649305555555]
[{"$f":"IF(ModelNo=B36,5,\"\")","v":""},"9054","Operating Sash Glass Width",{"$f":"Frame_Width-4.625","v":-4.625},null,34,"9112","9100 Twelve Foot Four Lite Patio Door",4.5,0.5,144,80,139.5,79.5,139.5,79.5,220,"Standard",null,null,null,"Half",null,null,5,null,"<< Rough Opening Only",null,null,null,null,null,null,null,null,null,0,"9054",{"$f":"MAX($D$36,$D$38)","v":-4.625},{"$f":"MAX($D$37,$D$39)","v":-4.375},0.14051649305555555]
[{"$f":"IF(ModelNo=B37,6,\"\")","v":""},"9054","Operating Sash Glass Height",{"$f":"(Frame_Height/2)-4.375","v":-4.375},null,35,"9122","9100 Twelve Foot Three Lite Patio Door",3.125,0.5,144,80,140.875,79.5,140.875,79.5,221,"Standard",null,null,null,"Half",null,null,5,null,"<< Rough Opening Only",null,null,null,null,null,null,null,null,null,0,"9055",{"$f":"$D$45","v":-4.625},{"$f":"$D$46","v":-4.375},0.14051649305555555]
[{"$f":"IF(ModelNo=B38,7,\"\")","v":""},"9054","Fixed Sash Glass Width",{"$f":"Frame_Width-4.625","v":-4.625},null,36,"9175","9100 Wisconsin Two Lite Patio Door",0.5,0.5,75,80,74.5,79.5,74.5,79.5,154,"Standard",null,null,null,"Half",null,null,5,null,"<< Rough Opening Only",null,null,null,null,null,null,null,null,null,0,"9070",{"$f":"$D$50","v":-4.625},{"$f":"$D$51","v":-4.625},0.14854600694444445]
[{"$f":"IF(ModelNo=B39,8,\"\")","v":""},"9054","Fixed Sash Glass Height",{"$f":"(Frame_Height/2)-4.375","v":-4.375},null,37,"9202","9200 Custom Two Lite Patio Door",0,0,null,null,48,72,96,96,192,null,null,null,null,"Half",null,null,5,null,{"$f":"IF(RO=2,\"<< Exact Size Only\",\"\")","v":""},null,null,null,null,null,null,null,null,null,0,"9071",{"$f":"$D$55","v":-4.625},{"$f":"$D$56","v":-4.625},0.14854600694444445]
[{"$f":"IF(ModelNo=B40,9,\"\")","v":""},"9054","Screen Width",{"$f":"Frame_Width-4","v":-4},null,38,"9203","9200 Custom Three Lite Patio Door",0,0,null,null,84,72,144,96,240,null,null,null,null,"Half",null,null,5,null,{"$f":"IF(RO=2,\"<< Exact Size Only\",\"\")","v":""},null,null,null,null,null,null,null,null,null,0,"9072",{"$f":"$D$67","v":-4.375},{"$f":"$D$68","v":-4.625},0.14051649305555555]
[{"$f":"IF(ModelNo=B41,10,\"\")","v":""},"9054","Screen Height",{"$f":"(Frame_Height/2)-3.6875","v":-3.6875},null,39,"9204","9200 Custom Four Lite Patio Door",0,0,null,null,96,72,144,96,240,null,null,null,null,"Half",null,null,5,null,{"$f":"IF(RO=2,\"<< Exact Size Only\",\"\")","v":""},null,null,null,null,null,null,null,null,null,0,"9073",{"$f":"MAX($D$81,$D$83)","v":-4.125},{"$f":"MAX($D$82,$D$84)","v":-4.625},0.13248697916666666]
[{"$f":"IF(ModelNo=B42,11,\"\")","v":""},"9054","Awning Does not Meet Egress",null,null,40,"9205","9200 Five Foot Two Lite Patio Door",1.375,0.5,60,80,58.625,79.5,58.625,79.5,139,"Standard",null,null,null,"Half",null,null,5,null,{"$f":"IF(RO=1,\"<< Rough Opening Only\",\"\")","v":"<< Rough Opening Only"},null,null,null,null,null,null,null,null,null,0,"9074",{"$f":"MAX($D$113,$D$115)","v":-4.25},{"$f":"MAX($D$114,$D$116)","v":-4.625},0.1365017361111111]
[{"$f":"IF(ModelNo=B43,1,\"\")","v":""},"9055","Sash Width",{"$f":"Frame_Width-1.625","v":-1.625},null,41,"9206","9200 Six Foot Two Lite Patio Door",1.375,0.5,72,80,70.625,79.5,70.625,79.5,151,"Standard",null,null,null,"Half",null,null,5,null,"<< Rough Opening Only",null,null,null,null,null,null,null,null,null,0,"9075",{"$f":"MAX($D$129,$D$131)","v":-4.1875},{"$f":"MAX($D$130,$D$132)","v":-4.625},0.1344943576388889]
[{"$f":"IF(ModelNo=B44,2,\"\")","v":""},"9055","Sash Height",{"$f":"(Frame_Height/2)-1.375","v":-1.375},null,42,"9208","9200 Eight Foot Two Lite Patio Door",1.75,0.5,96,80,94.25,79.5,94.25,79.5,175,"Standard",null,null,null,"Half",null,null,5,null,"<< Rough Opening Only",null,null,null,null,null,null,null,null,null,0,"9079",{"$f":"MAX($D$97,$D$99)","v":-4.25},{"$f":"MAX($D$98,$D$100)","v":-4.625},0.1365017361111111]
[{"$f":"IF(ModelNo=B45,3,\"\")","v":""},"9055","Sash Glass Width",{"$f":"(Frame_Width)-4.625","v":-4.625},null,43,"9209","9200 Nine Foot Three Lite Patio Door",2.625,0.5,108,80,105.5,79.5,105.5,79.5,186,"Standard",null,null,null,"Half",null,null,5,null,"<< Rough Opening Only",null,null,null,null,null,null,null,null,null,0,"9102",{"$f":"$D$240","v":-3.75},{"$f":"$D$241","v":-8.9375},0.23274739583333334]
[{"$f":"IF(ModelNo=B46,4,\"\")","v":""},"9055","Sash Glass Height",{"$f":"(Frame_Height/2)-4.375","v":-4.375},null,44,"9212","9200 Twelve Foot Four Lite Patio Door",4.375,0.5,144,80,139.5,79.5,139.5,79.5,220,"Standard",null,null,null,"Half",null,null,5,null,"<< Rough Opening Only",null,null,null,null,null,null,null,null,null,0,"9103",{"$f":"$D$252","v":-3.5625},{"$f":"$D$253","v":-8.9375},0.22111002604166666]
[{"$f":"IF(ModelNo=B47,5,\"\")","v":""},"9055","Screen Width",{"$f":"Frame_Width-4","v":-4},null,45,"9222","9200 Twelve Foot Three Lite Patio Door",3.1875,0.5,144,80,140.875,79.5,140.875,79.5,221,"Standard",null,null,null,"Half",null,null,5,null,"<< Rough Opening Only",null,null,null,null,null,null,null,null,null,0,"9104",{"$f":"$D$266","v":-3.25},{"$f":"$D$267","v":-8.9375},0.20171440972222221]
[{"$f":"IF(ModelNo=B48,6,\"\")","v":""},"9055","Screen Height",{"$f":"(Frame_Height/2)-3.6875","v":-3.6875},null,46,"9275","9200 Wisconsin Two Lite Patio Door",0.5,0.5,75,80,74.5,79.5,74.5,79.5,154,"Standard",null,null,null,"Half",null,null,5,null,"<< Rough Opening Only",null,null,null,null,null,null,null,null,null,0,"9105",{"$f":"$D$240","v":-3.75},{"$f":"$D$241","v":-8.9375},0.23274739583333334]
[{"$f":"IF(ModelNo=B49,7,\"\")","v":""},"9055","Awning Does not Meet Egress",null,null,47,"9402","9400 Series Custom 2 Lite Patio Door",0,0,null,null,48,72,96,96,192,"3\" Sash","5\" Sash","French",null,"Half",null,null,5,null,{"$f":"IF(RO=2,\"<< Exact Size Only\",\"\")","v":""},null,null,null,null,null,null,null,null,null,0,"9106",{"$f":"$D$240","v":-3.75},{"$f":"$D$241","v":-8.9375},0.23274739583333334]
[{"$f":"IF(OR(ModelNo=\"9014\",ModelNo=\"9070\",ModelNo=\"P970\"),1,\"\")","v":""},"9070","Glass Width",{"$f":"Frame_Width-4.625","v":-4.625},null,48,"9403","9400 Series Custom 3 Lite Patio Door",0,0,null,null,84,72,144,96,228,"3\" Sash","5\" Sash","French",null,"Half",null,null,5,null,{"$f":"IF(RO=2,\"<< Exact Size Only\",\"\")","v":""},null,null,null,null,null,null,null,null,null,0,"9108",{"$f":"$D$240","v":-3.75},{"$f":"$D$241","v":-8.9375},0.23274739583333334]
[{"$f":"IF(OR(ModelNo=\"9014\",ModelNo=\"9070\",ModelNo=\"P970\"),2,\"\")","v":""},"9070","Glass Height",{"$f":"Frame_Height-4.625","v":-4.625},null,49,"9404","9400 Series Custom 4 Lite Patio Door",0,0,null,null,96,72,144,96,240,"3\" Sash","5\" Sash","French",null,"Half",null,null,5,null,{"$f":"IF(RO=2,\"<< Exact Size Only\",\"\")","v":""},null,null,null,null,null,null,null,null,null,0,"9109",{"$f":"$D$252","v":-3.5625},{"$f":"$D$253","v":-8.9375},0.22111002604166666]
[{"$f":"IF(OR(ModelNo=\"9014\",ModelNo=\"9070\",ModelNo=\"P970\"),3,\"\")","v":""},"9070","Glass Area (sq.ft.)",{"$f":"(D50*D51)/144","v":0.14854600694444445},null,50,"9405","9400 Series Five Foot 2 Lite Patio Door",1.375,0.5,60,80,58.625,79.5,58.625,79.5,155,"3\" Sash","5\" Sash","French",null,"Half",null,null,5,null,{"$f":"IF(RO=1,\"<< Rough Opening Only\",\"\")","v":"<< Rough Opening Only"},null,null,null,null,null,null,null,null,null,0,"9112",{"$f":"$D$266","v":-3.25},{"$f":"$D$267","v":-8.9375},0.20171440972222221]
[{"$f":"IF(OR(ModelNo=\"9071\",ModelNo=\"P971\"),1,\"\")","v":""},"9071","Sash Width",{"$f":"Frame_Width-1.625","v":-1.625},null,51,"9406","9400 Series Six Foot 2 Lite Patio Door",1.375,0.5,72,80,70.625,79.5,70.625,79.5,167,"3\" Sash","5\" Sash","French",null,"Half",null,null,5,null,"<< Rough Opening Only",null,null,null,null,null,null,null,null,null,0,"9122",{"$f":"$D$252","v":-3.5625},{"$f":"$D$253","v":-8.9375},0.22111002604166666]
[{"$f":"IF(OR(ModelNo=\"9071\",ModelNo=\"P971\"),2,\"\")","v":""},"9071","Sash Height",{"$f":"Frame_Height-1.625","v":-1.625},null,52,"9408","9400 Series Eight Foot 2 Lite Patio Door",1.5,0.5,96,80,94.5,79.5,94.5,79.5,190,"3\" Sash","5\" Sash","French",null,"Half",null,null,5,null,"<< Rough Opening Only",null,null,null,null,null,null,null,null,null,0,"9175",{"$f":"$D$240","v":-3.75},{"$f":"$D$241","v":-8.9375},0.23274739583333334]
[{"$f":"IF(OR(ModelNo=\"9071\",ModelNo=\"P971\"),3,\"\")","v":""},"9071","Glass Width",{"$f":"Frame_Width-4.625","v":-4.625},null,53,"9409","9400 Series Nine Foot 3 Lite Patio Door",2.5,0.5,108,80,105.5,79.5,105.5,79.5,201,"3\" Sash","5\" Sash","French",null,"Half",null,null,5,null,"<< Rough Opening Only",null,null,null,null,null,null,null,null,null,0,"9202",{"$f":"$D$278","v":-3.6875},{"$f":"$D$279","v":-6.875},0.1760525173611111]
[{"$f":"IF(OR(ModelNo=\"9071\",ModelNo=\"P971\"),4,\"\")","v":""},"9071","Glass Height",{"$f":"Frame_Height-4.625","v":-4.625},null,54,"9412","9400 Series Twelve Foot 4 Lite Patio Door",4.5,0.5,144,80,139.5,79.5,139.5,79.5,235,"3\" Sash","5\" Sash","French",null,"Half",null,null,5,null,"<< Rough Opening Only",null,null,null,null,null,null,null,null,null,0,"9203",{"$f":"$D$290","v":-3.4375},{"$f":"$D$291","v":-6.875},0.16411675347222221]
[{"$f":"IF(OR(ModelNo=\"9071\",ModelNo=\"P971\"),5,\"\")","v":""},"9071","Screen Width",{"$f":"Frame_Width-4.0625","v":-4.0625},null,55,"9422","9400 Series Twelve Foot 3 Lite Patio Door",3.125,0.5,144,80,140.875,79.5,140.875,79.5,237,"3\" Sash","5\" Sash","French",null,"Half",null,null,5,null,"<< Rough Opening Only",null,null,null,null,null,null,null,null,null,0,"9204",{"$f":"$D$302","v":-3.1875},{"$f":"$D$303","v":-6.875},0.15218098958333334]
[{"$f":"IF(OR(ModelNo=\"9071\",ModelNo=\"P971\"),6,\"\")","v":""},"9071","Screen Height",{"$f":"Frame_Height-4","v":-4},null,56,"9475","9400 Series Wisconsin 2 Lite Patio Door",0.5,0.5,75,80,74.5,79.5,74.5,79.5,155,"3\" Sash","5\" Sash","French",null,"Half",null,null,5,null,"<< Rough Opening Only",null,null,null,null,null,null,null,null,null,0,"9205",{"$f":"$D$278","v":-3.6875},{"$f":"$D$279","v":-6.875},0.1760525173611111]
[{"$f":"IF(OR(ModelNo=\"9071\",ModelNo=\"P971\"),7,\"\")","v":""},"9071","Egress Opening Width (Standard Hinge)",{"$f":"Frame_Width-11.25","v":-11.25},null,57,"P601","Preservation Bay-Bow Double Hung",0,0,null,null,16,26,52,84,136,"Standard","Oriel (2/3 - 1/3)","Cottage (1/3 - 2/3)","Custom","Half","Full","Locking",5,null,{"$f":"IF(RO=2,\"<< Exact Size Only\",\"\")","v":""},null,null,null,null,null,null,null,null,null,0,"9206",{"$f":"$D$278","v":-3.6875},{"$f":"$D$279","v":-6.875},0.1760525173611111]
[{"$f":"IF(OR(ModelNo=\"9071\",ModelNo=\"P971\"),8,\"\")","v":""},"9071","Egress Opening Height (Standard Hinge)",{"$f":"Frame_Height-4.375","v":-4.375},null,58,"P970","Preservation Bay-Bow Picture Window",0,0,null,null,13,13,96,84,154,"Standard",null,null,null,null,null,null,5,null,{"$f":"IF(RO=2,\"<< Exact Size Only\",\"\")","v":""},null,null,null,null,null,null,null,null,null,0,"9208",{"$f":"$D$278","v":-3.6875},{"$f":"$D$279","v":-6.875},0.1760525173611111]
[{"$f":"IF(OR(ModelNo=\"9071\",ModelNo=\"P971\"),9,\"\")","v":""},"9071","Egress Opening Area w/Standard Hinge (sq.ft.)",{"$f":"(D59*D60)/144","v":0.341796875},null,59,"P971","Preservation Bay-Bow Single Vent Casement",0,0,null,null,16,19,36,78,114,"Standard",null,null,null,null,"Full",null,5,null,{"$f":"IF(RO=2,\"<< Exact Size Only\",\"\")","v":""},null,null,null,null,null,null,null,null,null,0,"9209",{"$f":"$D$290","v":-3.4375},{"$f":"$D$291","v":-6.875},0.16411675347222221]
[{"$f":"IF(OR(ModelNo=\"9071\",ModelNo=\"P971\"),10,\"\")","v":""},"9071","Egress Opening Width (Egress Hinge)",{"$f":"IF(D53<22.375,\"N/A\",Frame_Width-6.8125)","v":"N/A"},null,1,{"$f":"VLOOKUP(Model_Select,$F$3:$AA$61,2,FALSE)","v":"Select a Model"},{"$f":"VLOOKUP(Model_Select,$F$3:$AA$61,3,FALSE)","v":0},{"$f":"VLOOKUP(Model_Select,$F$3:$AA$61,4,FALSE)","v":0},{"$f":"VLOOKUP(Model_Select,$F$3:$AA$61,5,FALSE)","v":0},{"$f":"VLOOKUP(Model_Select,$F$3:$AA$61,6,FALSE)","v":0},{"$f":"VLOOKUP(Model_Select,$F$3:$AA$61,7,FALSE)","v":0},{"$f":"VLOOKUP(Model_Select,$F$3:$AA$61,8,FALSE)","v":0},{"$f":"VLOOKUP(Model_Select,$F$3:$AA$61,9,FALSE)","v":0},{"$f":"VLOOKUP(Model_Select,$F$3:$AA$61,10,FALSE)","v":0},{"$f":"VLOOKUP(Model_Select,$F$3:$AA$61,11,FALSE)","v":0},{"$f":"VLOOKUP(Model_Select,$F$3:$AA$61,12,FALSE)","v":0},{"$f":"VLOOKUP(Model_Select,$F$3:$AA$61,13,FALSE)","v":0},{"$f":"VLOOKUP(Model_Select,$F$3:$AA$61,14,FALSE)","v":0},{"$f":"VLOOKUP(Model_Select,$F$3:$AA$61,15,FALSE)","v":0},{"$f":"VLOOKUP(Model_Select,$F$3:$AA$61,16,FALSE)","v":0},{"$f":"VLOOKUP(Model_Select,$F$3:$AA$61,17,FALSE)","v":0},{"$f":"VLOOKUP(Model_Select,$F$3:$AA$61,18,FALSE)","v":0},{"$f":"VLOOKUP(Model_Select,$F$3:$AA$61,19,FALSE)","v":0},{"$f":"VLOOKUP(Model_Select,$F$3:$AA$61,20,FALSE)","v":0},{"$f":"VLOOKUP(Model_Select,$F$3:$AA$61,21,FALSE)","v":0},{"$f":"VLOOKUP(Model_Select,$F$3:$AA$61,22,FALSE)","v":0},null,null,null,null,null,null,null,null,null,0,"9212",{"$f":"$D$302","v":-3.1875},{"$f":"$D$303","v":-6.875},0.15218098958333334]
[{"$f":"IF(OR(ModelNo=\"9071\",ModelNo=\"P971\"),11,\"\")","v":""},"9071","Egress Opening Height (Egress Hinge)",{"$f":"IF(D53<22.375,\"N/A\",Frame_Height-4.375)","v":"N/A"},null,null,null,null,null,null,null,{"$f":"IF(OR(ModelNo=\"9405\",ModelNo=\"9406\",ModelNo=\"9408\",ModelNo=\"9409\",ModelNo=\"9412\",ModelNo=\"9422\"),1,0)","v":0},null,null,null,null,null,null,null,null,null,null,null,null,null,null,null,null,null,null,null,null,null,null,null,null,0,"9222",{"$f":"$D$290","v":-3.4375},{"$f":"$D$291","v":-6.875},0.16411675347222221]
[{"$f":"IF(OR(ModelNo=\"9071\",ModelNo=\"P971\"),12,\"\")","v":""},"9071","Egress Opening Area w/Egress Hinge (sq.ft.)",{"$f":"IF(D53<22.375,\"N/A\",(D62*D63)/144)","v":"N/A"},null,null,null,null,null,null,null,{"$f":"IF(HCONTROL=1,96,\"\")","v":""},null,null,null,null,null,null,null,null,null,null,null,null,null,null,null,null,null,null,null,null,null,null,null,null,0,"9275",{"$f":"$D$278","v":-3.6875},{"$f":"$D$279","v":-6.875},0.1760525173611111]
[{"$f":"IF(ModelNo=B65,1,\"\")","v":""},"9072","Sash Width",{"$f":"(Frame_Width/2)-1.375","v":-1.375},null,null,null,null,null,null,null,null,null,null,null,null,null,null,null,null,null,null,null,null,null,null,null,null,null,null,null,null,null,null,null,null,0,"P601",{"$f":"MAX($D$145,$D$147)","v":-6.71875},{"$f":"MAX($D$146,$D$148)","v":-3.96875},0.18517388237847221,{"$f":"IF(ISERROR(OR($D$152,$D$154)),0,IF(AND(OR(Glass=5,Glass=6),OR($D$152=0,$D$154=0)),1,0))","v":0}]
[{"$f":"IF(ModelNo=B66,2,\"\")","v":""},"9072","Sash Height",{"$f":"Frame_Height-1.625","v":-1.625},null,null,null,null,null,null,null,null,null,null,null,null,null,null,null,null,null,null,null,null,null,null,null,null,null,null,null,null,null,null,null,null,0,"P970",{"$f":"$D$50","v":-4.625},{"$f":"$D$51","v":-4.625},0.14854600694444445]
[{"$f":"IF(ModelNo=B67,3,\"\")","v":""},"9072","Glass Width",{"$f":"(Frame_Width/2)-4.375","v":-4.375},null,null,null,null,null,null,null,null,null,null,null,null,null,null,null,null,null,null,null,null,null,null,null,null,null,null,null,null,null,null,null,null,null,"P971",{"$f":"$D$55","v":-4.625},{"$f":"$D$56","v":-4.625},{"$f":"(AM67*AN67)/144","v":0.14854600694444445}]
[{"$f":"IF(ModelNo=B68,4,\"\")","v":""},"9072","Glass Height",{"$f":"Frame_Height-4.625","v":-4.625},null,null,null,null,null,null,null,null,null,null,null,null,null,null,null,null,null,null,null,null,null,null,null,null,null,null,null,null,null,null,null,null,null,{"$f":"IF(ISERROR(VLOOKUP(ModelNo,TIGTABLE,2,FALSE)),\"\",ModelNo)","v":""},{"$f":"IF(ISERROR(VLOOKUP(TIGMODEL,TIGTABLE,3,FALSE)),\"\",VLOOKUP(TIGMODEL,TIGTABLE,3,FALSE))","v":""},{"$f":"IF(ISERROR(VLOOKUP(TIGMODEL,TIGTABLE,4,FALSE)),\"\",VLOOKUP(TIGMODEL,TIGTABLE,4,FALSE))","v":""},{"$f":"IF(ISERROR(VLOOKUP(TIGMODEL,TIGTABLE,5,FALSE)),\"\",VLOOKUP(TIGMODEL,TIGTABLE,5,FALSE))","v":""},{"$f":"IF(ISERROR(VLOOKUP(TIGMODEL,TIGTABLE,6,FALSE)),\"\",VLOOKUP(TIGMODEL,TIGTABLE,6,FALSE))","v":""}]
[{"$f":"IF(ModelNo=B69,5,\"\")","v":""},"9072","Screen Width",{"$f":"(Frame_Width/2)-3.8125","v":-3.8125}]
[{"$f":"IF(ModelNo=B70,6,\"\")","v":""},"9072","Screen Height",{"$f":"Frame_Height-4","v":-4}]
[{"$f":"IF(ModelNo=B71,7,\"\")","v":""},"9072","Egress Opening Width (Standard Hinge)",{"$f":"(Frame_Width/2)-11","v":-11}]
[{"$f":"IF(ModelNo=B72,8,\"\")","v":""},"9072","Egress Opening Height (Standard Hinge)",{"$f":"Frame_Height-4.375","v":-4.375}]
[{"$f":"IF(ModelNo=B73,9,\"\")","v":""},"9072","Egress Opening Area w/Standard Hinge (sq.ft.)",{"$f":"(D71*D72)/144","v":0.3342013888888889}]
[{"$f":"IF(ModelNo=B74,10,\"\")","v":""},"9072","Egress Opening Width (Egress Hinge)",{"$f":"IF(D65<22.375,\"N/A\",(Frame_Width/2)-6.5625)","v":"N/A"}]
[{"$f":"IF(ModelNo=B75,11,\"\")","v":""},"9072","Egress Opening Height (Egress Hinge)",{"$f":"IF(D65<22.375,\"N/A\",Frame_Height-4.375)","v":"N/A"}]
[{"$f":"IF(ModelNo=B76,12,\"\")","v":""},"9072","Egress Opening Area w/Egress Hinge (sq.ft.)",{"$f":"IF(D65<22.375,\"N/A\",(D74*D75)/144)","v":"N/A"}]
[{"$f":"IF(ModelNo=B77,1,\"\")","v":""},"9073","Operating Sash Width",{"$f":"(Frame_Width/4)-1.375","v":-1.375}]
[{"$f":"IF(ModelNo=B78,2,\"\")","v":""},"9073","Operating Sash Height",{"$f":"Frame_Height-1.625","v":-1.625}]
[{"$f":"IF(ModelNo=B79,3,\"\")","v":""},"9073","Fixed Sash Width",{"$f":"(Frame_Width/2)-1.125","v":-1.125}]
[{"$f":"IF(ModelNo=B80,4,\"\")","v":""},"9073","Fixed Sash Height",{"$f":"Frame_Height-1.625","v":-1.625}]
[{"$f":"IF(ModelNo=B81,5,\"\")","v":""},"9073","Operating Sash Glass Width",{"$f":"(Frame_Width/4)-4.375","v":-4.375}]
[{"$f":"IF(ModelNo=B82,6,\"\")","v":""},"9073","Operating Sash Glass Height",{"$f":"Frame_Height-4.625","v":-4.625}]
[{"$f":"IF(ModelNo=B83,7,\"\")","v":""},"9073","Fixed Sash Glass Width",{"$f":"(Frame_Width/2)-4.125","v":-4.125}]
[{"$f":"IF(ModelNo=B84,8,\"\")","v":""},"9073","Fixed Sash Glass Height",{"$f":"Frame_Height-4.625","v":-4.625}]
[{"$f":"IF(ModelNo=B85,9,\"\")","v":""},"9073","Screen Width",{"$f":"(Frame_Width/4)-3.8125","v":-3.8125}]
[{"$f":"IF(ModelNo=B86,10,\"\")","v":""},"9073","Screen Height",{"$f":"Frame_Height-4","v":-4}]
[{"$f":"IF(ModelNo=B87,11,\"\")","v":""},"9073","Egress Opening Width (Standard Hinge)",{"$f":"(Frame_Width/4)-11","v":-11}]
[{"$f":"IF(ModelNo=B88,12,\"\")","v":""},"9073","Egress Opening Height (Standard Hinge)",{"$f":"Frame_Height-4.375","v":-4.375}]
[{"$f":"IF(ModelNo=B89,13,\"\")","v":""},"9073","Egress Opening Area w/Standard Hinge (sq.ft.)",{"$f":"(D87*D88)/144","v":0.3342013888888889}]
[{"$f":"IF(ModelNo=B90,14,\"\")","v":""},"9073","Egress Opening Width (Egress Hinge)",{"$f":"IF(D77<22.375,\"N/A\",(Frame_Width/4)-6.5625)","v":"N/A"}]
[{"$f":"IF(ModelNo=B91,15,\"\")","v":""},"9073","Egress Opening Height (Egress Hinge)",{"$f":"IF(D77<22.375,\"N/A\",Frame_Height-4.375)","v":"N/A"}]
[{"$f":"IF(ModelNo=B92,16,\"\")","v":""},"9073","Egress Opening Area w/Egress Hinge (sq.ft.)",{"$f":"IF(D77<22.375,\"N/A\",(D90*D91)/144)","v":"N/A"}]
[{"$f":"IF(ModelNo=B93,1,\"\")","v":""},"9079","Operating Sash Width",{"$f":"TRUNC(((Frame_Width/3)-1.291)*16+0.5)/16","v":-1.25}]
[{"$f":"IF(ModelNo=B94,2,\"\")","v":""},"9079","Operating Sash Height",{"$f":"Frame_Height-1.625","v":-1.625}]
[{"$f":"IF(ModelNo=B95,3,\"\")","v":""},"9079","Fixed Sash Width",{"$f":"TRUNC(((Frame_Width/3)-1.291)*16+0.5)/16","v":-1.25}]
[{"$f":"IF(ModelNo=B96,4,\"\")","v":""},"9079","Fixed Sash Height",{"$f":"Frame_Height-1.625","v":-1.625}]
[{"$f":"IF(ModelNo=B97,5,\"\")","v":""},"9079","Operating Sash Glass Width",{"$f":"TRUNC(((Frame_Width/3)-4.291)*16+0.5)/16","v":-4.25}]
[{"$f":"IF(ModelNo=B98,6,\"\")","v":""},"9079","Operating Sash Glass Height",{"$f":"Frame_Height-4.625","v":-4.625}]
[{"$f":"IF(ModelNo=B99,7,\"\")","v":""},"9079","Fixed Sash Glass Width",{"$f":"TRUNC(((Frame_Width/3)-4.291)*16+0.5)/16","v":-4.25}]
[{"$f":"IF(ModelNo=B100,8,\"\")","v":""},"9079","Fixed Sash Glass Height",{"$f":"Frame_Height-4.625","v":-4.625}]
[{"$f":"IF(ModelNo=B101,9,\"\")","v":""},"9079","Screen Width",{"$f":"TRUNC(((Frame_Width/3)-3.666)*32+0.5)/32","v":-3.625}]
[{"$f":"IF(ModelNo=B102,10,\"\")","v":""},"9079","Screen Height",{"$f":"Frame_Height-4","v":-4}]
[{"$f":"IF(ModelNo=B103,11,\"\")","v":""},"9079","Egress Opening Width (Standard Hinge)",{"$f":"TRUNC(((Frame_Width/3)-10.916)*16+0.5)/16","v":-10.875}]
[{"$f":"IF(ModelNo=B104,12,\"\")","v":""},"9079","Egress Opening Height (Standard Hinge)",{"$f":"Frame_Height-4.375","v":-4.375}]
[{"$f":"IF(ModelNo=B105,13,\"\")","v":""},"9079","Egress Opening Area w/Standard Hinge (sq.ft.)",{"$f":"(D103*D104)/144","v":0.33040364583333331}]
[{"$f":"IF(ModelNo=B106,14,\"\")","v":""},"9079","Egress Opening Width (Egress Hinge)",{"$f":"IF(D93<22.375,\"N/A\",TRUNC(((Frame_Width/3)-6.4785)*16+0.5)/16)","v":"N/A"}]
[{"$f":"IF(ModelNo=B107,15,\"\")","v":""},"9079","Egress Opening Height (Egress Hinge)",{"$f":"IF(D93<22.375,\"N/A\",Frame_Height-4.375)","v":"N/A"}]
[{"$f":"IF(ModelNo=B108,16,\"\")","v":""},"9079","Egress Opening Area w/Egress Hinge (sq.ft.)",{"$f":"IF(D93<22.375,\"N/A\",(D106*D107)/144)","v":"N/A"}]
[{"$f":"IF(ModelNo=B109,1,\"\")","v":""},"9074","Operating Sash Width",{"$f":"(Frame_Width/4)-1.25","v":-1.25}]
[{"$f":"IF(ModelNo=B110,2,\"\")","v":""},"9074","Operating Sash Height",{"$f":"Frame_Height-1.625","v":-1.625}]
[{"$f":"IF(ModelNo=B111,3,\"\")","v":""},"9074","Fixed Sash Width",{"$f":"(Frame_Width/4)-1.25","v":-1.25}]
[{"$f":"IF(ModelNo=B112,4,\"\")","v":""},"9074","Fixed Sash Height",{"$f":"Frame_Height-1.625","v":-1.625}]
[{"$f":"IF(ModelNo=B113,5,\"\")","v":""},"9074","Operating Sash Glass Width",{"$f":"(Frame_Width/4)-4.25","v":-4.25}]
[{"$f":"IF(ModelNo=B114,6,\"\")","v":""},"9074","Operating Sash Glass Height",{"$f":"Frame_Height-4.625","v":-4.625}]
[{"$f":"IF(ModelNo=B115,7,\"\")","v":""},"9074","Fixed Sash Glass Width",{"$f":"(Frame_Width/4)-4.25","v":-4.25}]
[{"$f":"IF(ModelNo=B116,8,\"\")","v":""},"9074","Fixed Sash Glass Height",{"$f":"Frame_Height-4.625","v":-4.625}]
[{"$f":"IF(ModelNo=B117,9,\"\")","v":""},"9074","Screen Width",{"$f":"(Frame_Width/4)-3.625","v":-3.625}]
[{"$f":"IF(ModelNo=B118,10,\"\")","v":""},"9074","Screen Height",{"$f":"Frame_Height-4","v":-4}]
[{"$f":"IF(ModelNo=B119,11,\"\")","v":""},"9074","Egress Opening Width (Standard Hinge)",{"$f":"(Frame_Width/4)-10.875","v":-10.875}]
[{"$f":"IF(ModelNo=B120,12,\"\")","v":""},"9074","Egress Opening Height (Standard Hinge)",{"$f":"Frame_Height-4.375","v":-4.375}]
[{"$f":"IF(ModelNo=B121,13,\"\")","v":""},"9074","Egress Opening Area w/Standard Hinge (sq.ft.)",{"$f":"(D119*D120)/144","v":0.33040364583333331}]
[{"$f":"IF(ModelNo=B122,14,\"\")","v":""},"9074","Egress Opening Width (Egress Hinge)",{"$f":"IF(D109<22.375,\"N/A\",(Frame_Width/4)-6.4375)","v":"N/A"}]
[{"$f":"IF(ModelNo=B123,15,\"\")","v":""},"9074","Egress Opening Height (Egress Hinge)",{"$f":"IF(D109<22.375,\"N/A\",Frame_Height-4.375)","v":"N/A"}]
[{"$f":"IF(ModelNo=B124,16,\"\")","v":""},"9074","Egress Opening Area w/Egress Hinge (sq.ft.)",{"$f":"IF(D109<22.375,\"N/A\",(D122*D123)/144)","v":"N/A"}]
[{"$f":"IF(ModelNo=B125,1,\"\")","v":""},"9075","Operating Sash Width",{"$f":"TRUNC(((Frame_Width/5)-1.225)*16+0.5)/16","v":-1.1875}]
[{"$f":"IF(ModelNo=B126,2,\"\")","v":""},"9075","Operating Sash Height",{"$f":"Frame_Height-1.625","v":-1.625}]
[{"$f":"IF(ModelNo=B127,3,\"\")","v":""},"9075","Fixed Sash Width",{"$f":"TRUNC(((Frame_Width/5)-1.225)*16+0.5)/16","v":-1.1875}]
[{"$f":"IF(ModelNo=B128,4,\"\")","v":""},"9075","Fixed Sash Height",{"$f":"Frame_Height-1.625","v":-1.625}]
[{"$f":"IF(ModelNo=B129,5,\"\")","v":""},"9075","Operating Sash Glass Width",{"$f":"TRUNC(((Frame_Width/5)-4.225)*16+0.5)/16","v":-4.1875}]
[{"$f":"IF(ModelNo=B130,6,\"\")","v":""},"9075","Operating Sash Glass Height",{"$f":"Frame_Height-4.625","v":-4.625}]
[{"$f":"IF(ModelNo=B131,7,\"\")","v":""},"9075","Fixed Sash Glass Width",{"$f":"TRUNC(((Frame_Width/5)-4.225)*16+0.5)/16","v":-4.1875}]
[{"$f":"IF(ModelNo=B132,8,\"\")","v":""},"9075","Fixed Sash Glass Height",{"$f":"Frame_Height-4.625","v":-4.625}]
[{"$f":"IF(ModelNo=B133,9,\"\")","v":""},"9075","Screen Width",{"$f":"TRUNC(((Frame_Width/5)-3.7625)*16+0.5)/16","v":-3.6875}]
[{"$f":"IF(ModelNo=B134,10,\"\")","v":""},"9075","Screen Height",{"$f":"Frame_Height-4","v":-4}]
[{"$f":"IF(ModelNo=B135,11,\"\")","v":""},"9075","Egress Opening Width (Standard Hinge)",{"$f":"TRUNC(((Frame_Width/5)-10.875)*16+0.5)/16","v":-10.8125}]
[{"$f":"IF(ModelNo=B136,12,\"\")","v":""},"9075","Egress Opening Height (Standard Hinge)",{"$f":"Frame_Height-4.375","v":-4.375}]
[{"$f":"IF(ModelNo=B137,13,\"\")","v":""},"9075","Egress Opening Area w/Standard Hinge (sq.ft.)",{"$f":"(D135*D136)/144","v":0.32850477430555558}]
[{"$f":"IF(ModelNo=B138,14,\"\")","v":""},"9075","Egress Opening Width (Egress Hinge)",{"$f":"IF(D125<22.375,\"N/A\",TRUNC(((Frame_Width/5)-6.4375)*16+0.5)/16)","v":"N/A"}]
[{"$f":"IF(ModelNo=B139,15,\"\")","v":""},"9075","Egress Opening Height (Egress Hinge)",{"$f":"IF(D125<22.375,\"N/A\",Frame_Height-4.375)","v":"N/A"}]
[{"$f":"IF(ModelNo=B140,16,\"\")","v":""},"9075","Egress Opening Area w/Egress Hinge (sq.ft.)",{"$f":"IF(D125<22.375,\"N/A\",(D138*D139)/144)","v":"N/A"}]
[{"$f":"IF(OR(ModelNo=\"9001\",ModelNo=\"P601\"),1,\"\")","v":""},"9001","Top Sash Width",{"$f":"Frame_Width-4.875","v":-4.875}]
[{"$f":"IF(OR(ModelNo=\"9001\",ModelNo=\"P601\"),2,\"\")","v":""},"9001","Top Sash Height",{"$f":"INT((Balance!$J$18-2.22)*32)/32","v":-2.25}]
[{"$f":"IF(OR(ModelNo=\"9001\",ModelNo=\"P601\"),3,\"\")","v":""},"9001","Bottom Sash Width",{"$f":"Frame_Width-3.875","v":-3.875}]
[{"$f":"IF(OR(ModelNo=\"9001\",ModelNo=\"P601\"),4,\"\")","v":""},"9001","Bottom Sash Height",{"$f":"INT((Balance!$J$19-1.22)*32)/32","v":-1.25}]
[{"$f":"IF(OR(ModelNo=\"9001\",ModelNo=\"P601\"),5,\"\")","v":""},"9001","Top Glass Width",{"$f":"Balance!$J$21","v":-6.71875}]
[{"$f":"IF(OR(ModelNo=\"9001\",ModelNo=\"P601\"),6,\"\")","v":""},"9001","Top Glass Height",{"$f":"Balance!$J$23","v":-3.96875}]
[{"$f":"IF(OR(ModelNo=\"9001\",ModelNo=\"P601\"),7,\"\")","v":""},"9001","Bottom Glass Width",{"$f":"Balance!$J$22","v":-6.71875}]
[{"$f":"IF(OR(ModelNo=\"9001\",ModelNo=\"P601\"),8,\"\")","v":""},"9001","Bottom Glass Height",{"$f":"Balance!$J$24","v":-3.96875}]
[{"$f":"IF(OR(ModelNo=\"9001\",ModelNo=\"P601\"),9,\"\")","v":""},"9001","Screen Width",{"$f":"Frame_Width-5.125","v":-5.125}]
[{"$f":"IF(OR(ModelNo=\"9001\",ModelNo=\"P601\"),10,\"\")","v":""},"9001","Screen Height",{"$f":"IF(Screen=\"Full\",Frame_Height-4.6875,IF(Screen=\"Locking\",(INT((Balance!$J$19-2.34375)*16+0.5)/16)+0.875,INT((Balance!$J$19-1.25)*16+0.5)/16))","v":-1.25}]
[{"$f":"IF(OR(ModelNo=\"9001\",ModelNo=\"P601\"),11,\"\")","v":""},"9001","Top Sash Weight (Plus 5 lb)",{"$f":"TOP_WGT&\" \"&\"lb\"","v":{"$error":"#N/A"}}]
[{"$f":"IF(OR(ModelNo=\"9001\",ModelNo=\"P601\"),12,\"\")","v":""},"9001","Top Balance Size (Block & Tackle)",{"$f":"IF(TOP_TUBE=0,\"N/A\",TOP_TUBE)","v":{"$error":"#N/A"}}]
[{"$f":"IF(OR(ModelNo=\"9001\",ModelNo=\"P601\"),13,\"\")","v":""},"9001","Bottom Sash Weight",{"$f":"BTM_WGT&\" \"&\"lb\"","v":{"$error":"#N/A"}}]
[{"$f":"IF(OR(ModelNo=\"9001\",ModelNo=\"P601\"),14,\"\")","v":""},"9001","Bottom Balance Size (Block & Tackle)",{"$f":"IF(BTM_TUBE=0,\"N/A\",BTM_TUBE)","v":{"$error":"#N/A"}}]
[{"$f":"IF(OR(ModelNo=\"9001\",ModelNo=\"P601\"),15,\"\")","v":""},"9001","Egress Opening Width",{"$f":"EW","v":{"$error":"#N/A"}}]
[{"$f":"IF(OR(ModelNo=\"9001\",ModelNo=\"P601\"),16,\"\")","v":""},"9001","Egress Opening Height",{"$f":"EH","v":{"$error":"#N/A"}}]
[{"$f":"IF(OR(ModelNo=\"9001\",ModelNo=\"P601\"),17,\"\")","v":""},"9001","Egress Opening Area (sq.ft.)",{"$f":"EO","v":{"$error":"#N/A"}}]
[{"$f":"IF(ModelNo=B158,1,\"\")","v":""},"9002","Sash Width",{"$f":"(Frame_Width/2)-0.875","v":-0.875}]
[{"$f":"IF(ModelNo=B159,2,\"\")","v":""},"9002","Sash Height",{"$f":"Frame_Height-4.625","v":-4.625}]
[{"$f":"IF(ModelNo=B160,3,\"\")","v":""},"9002","Roller Track Length",{"$f":"Frame_Width-3.25","v":-3.25}]
[{"$f":"IF(ModelNo=B161,4,\"\")","v":""},"9002","Glass Width",{"$f":"Frame_Width/2-3.75","v":-3.75}]
[{"$f":"IF(ModelNo=B162,5,\"\")","v":""},"9002","Glass Height",{"$f":"Frame_Height-7.4375","v":-7.4375}]
[{"$f":"IF(ModelNo=B163,6,\"\")","v":""},"9002","Screen Width",{"$f":"IF(Screen=\"Full\",INT((Frame_Width-4.882)*16+0.5)/16,IF(Screen=\"Half\",INT(((Frame_Width/2)-2.5)*16+0.5)/16,\"N/A\"))","v":"N/A"}]
[{"$f":"IF(ModelNo=B164,7,\"\")","v":""},"9002","Screen Height",{"$f":"INT((Frame_Height-4.651)*16+0.5)/16","v":-4.625}]
[{"$f":"IF(ModelNo=B165,8,\"\")","v":""},"9002","Egress Opening Width",{"$f":"TRUNC((Frame_Width/2-6.438)*16+0.5)/16","v":-6.375}]
[{"$f":"IF(ModelNo=B166,9,\"\")","v":""},"9002","Egress Opening Height",{"$f":"TRUNC((Frame_Height-5.75)*16+0.5)/16","v":-5.6875}]
[{"$f":"IF(ModelNo=B167,10,\"\")","v":""},"9002","Egress Opening Area (sq.ft.)",{"$f":"(D165*D166)/144","v":0.25179036458333331}]
[{"$f":"IF(ModelNo=B168,1,\"\")","v":""},"9003","Operating Sash Width",{"$f":"INT(((Frame_Width/4)+0.6515)*16+0.5)/16","v":0.625}]
[{"$f":"IF(ModelNo=B169,2,\"\")","v":""},"9003","Operating Sash Height",{"$f":"INT((Frame_Height-4.656)*16+0.5)/16","v":-4.625}]
[{"$f":"IF(ModelNo=B170,3,\"\")","v":""},"9003","Fixed Sash Width",{"$f":"INT(((Frame_Width-(2*(Frame_Width/4)))-1.52)*16+0.5)/16","v":-1.5}]
[{"$f":"IF(ModelNo=B171,4,\"\")","v":""},"9003","Fixed Sash Height",{"$f":"Frame_Height-4.625","v":-4.625}]
[{"$f":"IF(ModelNo=B172,5,\"\")","v":""},"9003","Roller Track Length",{"$f":"Frame_Width-3.125","v":-3.125}]
[{"$f":"IF(ModelNo=B173,6,\"\")","v":""},"9003","Operating Sash Glass Width",{"$f":"INT((D168-2.875)*16+0.5)/16","v":-2.25}]
[{"$f":"IF(ModelNo=B174,7,\"\")","v":""},"9003","Operating Sash Glass Height",{"$f":"Frame_Height-7.5","v":-7.5}]
[{"$f":"IF(ModelNo=B175,8,\"\")","v":""},"9003","Fixed Sash Glass Width",{"$f":"INT((D170-2.875)*16+0.5)/16","v":-4.375}]
[{"$f":"IF(ModelNo=B176,9,\"\")","v":""},"9003","Fixed Sash Glass Height",{"$f":"INT((D169-2.814)*16+0.5)/16","v":-7.4375}]
[{"$f":"IF(ModelNo=B177,10,\"\")","v":""},"9003","Screen Width",{"$f":"IF(Screen=\"Full\",INT((Frame_Width-4.882)*16+0.5)/16,IF(Screen=\"Half\",INT(((Frame_Width/4)-0.9405)*16+0.5)/16,\"N/A\"))","v":"N/A"}]
[{"$f":"IF(ModelNo=B178,11,\"\")","v":""},"9003","Screen Height",{"$f":"INT((Frame_Height-4.65)*16+0.5)/16","v":-4.625}]
[{"$f":"IF(ModelNo=B179,12,\"\")","v":""},"9003","Egress Opening Width",{"$f":"(Frame_Width/4)-2.125","v":-2.125}]
[{"$f":"IF(ModelNo=B180,13,\"\")","v":""},"9003","Egress Opening Height",{"$f":"Frame_Height-5.75","v":-5.75}]
[{"$f":"IF(ModelNo=B181,14,\"\")","v":""},"9003","Egress Opening Area (sq.ft.)",{"$f":"(D179*D180)/144","v":8.4852430555555552E-2}]
[{"$f":"IF(ModelNo=B182,1,\"\")","v":""},"9009","Operating Sash Width",{"$f":"(INT(((Frame_Width/3)-0.656)*16)/16)+0.625","v":-6.25E-2}]
[{"$f":"IF(ModelNo=B183,2,\"\")","v":""},"9009","Operating Sash Height",{"$f":"Frame_Height-4.625","v":-4.625}]
[{"$f":"IF(ModelNo=B184,3,\"\")","v":""},"9009","Fixed Sash Width",{"$f":"(INT((((INT(((Frame_Width/3)-0.656)*16)/16))+1.938)*16+0.5)/16)-1.3125","v":-6.25E-2}]
[{"$f":"IF(ModelNo=B185,4,\"\")","v":""},"9009","Fixed Sash Height",{"$f":"Frame_Height-4.625","v":-4.625}]
[{"$f":"IF(ModelNo=B186,5,\"\")","v":""},"9009","Roller Track Length",{"$f":"Frame_Width-3.125","v":-3.125}]
[{"$f":"IF(ModelNo=B187,6,\"\")","v":""},"9009","Operating Sash Glass Width",{"$f":"(INT((Frame_Width/3-0.656)*16)/16)-2.25","v":-2.9375}]
[{"$f":"IF(ModelNo=B188,7,\"\")","v":""},"9009","Operating Sash Glass Height",{"$f":"Frame_Height-7.4375","v":-7.4375}]
[{"$f":"IF(ModelNo=B189,8,\"\")","v":""},"9009","Fixed Sash Glass Width",{"$f":"(INT((Frame_Width/3-0.656)*16)/16)-2.25","v":-2.9375}]
[{"$f":"IF(ModelNo=B190,9,\"\")","v":""},"9009","Fixed Sash Glass Height",{"$f":"Frame_Height-7.4375","v":-7.4375}]
[{"$f":"IF(ModelNo=B191,10,\"\")","v":""},"9009","Screen Width",{"$f":"IF(Screen=\"Full\",INT((Frame_Width-4.882)*16+0.5)/16,IF(Screen=\"Half\",INT(((TRUNC(((Frame_Width/3)-0.656)*16)/16)-1.125)*16+0.5)/16,\"N/A\"))","v":"N/A"}]
[{"$f":"IF(ModelNo=B192,11,\"\")","v":""},"9009","Screen Height",{"$f":"INT((Frame_Height-4.65)*16+0.5)/16","v":-4.625}]
[{"$f":"IF(ModelNo=B193,12,\"\")","v":""},"9009","Egress Opening Width",{"$f":"(Frame_Width/3)-4.625","v":-4.625}]
[{"$f":"IF(ModelNo=B194,13,\"\")","v":""},"9009","Egress Opening Height",{"$f":"Frame_Height-5.75","v":-5.75}]
[{"$f":"IF(ModelNo=B195,14,\"\")","v":""},"9009","Egress Opening Area (sq.ft.)",{"$f":"(D193*D194)/144","v":0.18467881944444445}]
[{"$f":"IF(ModelNo=B196,1,\"\")","v":""},"9022","Inner Sash Width",{"$f":"TRUNC(((Frame_Width/2)-1.2925)*32+0.5)/32","v":-1.25}]
[{"$f":"IF(ModelNo=B197,2,\"\")","v":""},"9022","Inner Sash Height",{"$f":"Frame_Height-3.9375","v":-3.9375}]
[{"$f":"IF(ModelNo=B198,3,\"\")","v":""},"9022","Outer Sash Width",{"$f":"TRUNC(((Frame_Width/2)-2.2925)*32+0.5)/32","v":-2.25}]
[{"$f":"IF(ModelNo=B199,4,\"\")","v":""},"9022","Outer Sash Height",{"$f":"Frame_Height-4.9375","v":-4.9375}]
[{"$f":"IF(ModelNo=B200,5,\"\")","v":""},"9022","Inner Glass Width",{"$f":"TRUNC((D196-2.895)*32+0.5)/32","v":-4.125}]
[{"$f":"IF(ModelNo=B201,6,\"\")","v":""},"9022","Inner Glass Height",{"$f":"TRUNC((D197-2.8125)*32+0.5)/32","v":-6.71875}]
[{"$f":"IF(ModelNo=B202,7,\"\")","v":""},"9022","Outer Glass Width",{"$f":"TRUNC((D198-1.895)*32+0.5)/32","v":-4.125}]
[{"$f":"IF(ModelNo=B203,8,\"\")","v":""},"9022","Outer Glass Height",{"$f":"TRUNC((D199-1.8125)*32+0.5)/32","v":-6.71875}]
[{"$f":"IF(ModelNo=B204,9,\"\")","v":""},"9022","Screen Width",{"$f":"IF(Screen=\"Full\",INT((Frame_Width-5.59375)*16+0.5)/16,IF(Screen=\"Half\",INT(((Frame_Width/2)-2.3125)*16+0.5)/16,\"N/A\"))","v":"N/A"}]
[{"$f":"IF(ModelNo=B205,10,\"\")","v":""},"9022","Screen Height",{"$f":"Frame_Height-5.1875","v":-5.1875}]
[{"$f":"IF(ModelNo=B206,11,\"\")","v":""},"9022","Egress Opening Width",{"$f":"Frame_Width-(D196+7.875)","v":-6.625}]
[{"$f":"IF(ModelNo=B207,12,\"\")","v":""},"9022","Egress Opening Height",{"$f":"Frame_Height-6.125","v":-6.125}]
[{"$f":"IF(ModelNo=B208,13,\"\")","v":""},"9022","Egress Opening Area (sq.ft.)",{"$f":"(D206*D207)/144","v":0.28179253472222221}]
[{"$f":"IF(ModelNo=B209,1,\"\")","v":""},"9023","Operating Sash Width",{"$f":"TRUNC(((Frame_Width/4)+0.40625)*32+0.5)/32","v":0.40625}]
[{"$f":"IF(ModelNo=B210,2,\"\")","v":""},"9023","Operating Sash Height",{"$f":"Frame_Height-3.9375","v":-3.9375}]
[{"$f":"IF(ModelNo=B211,3,\"\")","v":""},"9023","Fixed Sash Width",{"$f":"TRUNC(((Frame_Width/2)-3.065)*32+0.5)/32","v":-3.03125}]
[{"$f":"IF(ModelNo=B212,4,\"\")","v":""},"9023","Fixed Sash Height",{"$f":"Frame_Height-4.9375","v":-4.9375}]
[{"$f":"IF(ModelNo=B213,5,\"\")","v":""},"9023","Operating Sash Glass Width",{"$f":"TRUNC((D209-2.875)*32+0.5)/32","v":-2.4375}]
[{"$f":"IF(ModelNo=B214,6,\"\")","v":""},"9023","Operating Sash Glass Height",{"$f":"TRUNC((D210-2.8125)*32+0.5)/32","v":-6.71875}]
[{"$f":"IF(ModelNo=B215,7,\"\")","v":""},"9023","Fixed Sash Glass Width",{"$f":"TRUNC((D211-1.875)*32+0.5)/32","v":-4.875}]
[{"$f":"IF(ModelNo=B216,8,\"\")","v":""},"9023","Fixed Sash Glass Height",{"$f":"TRUNC((D212-1.8125)*32+0.5)/32","v":-6.71875}]
[{"$f":"IF(ModelNo=B217,9,\"\")","v":""},"9023","Screen Width",{"$f":"IF(Screen=\"Full\",INT((Frame_Width-5.59375)*16+0.5)/16,IF(Screen=\"Half\",INT(((Frame_Width/4)-0.5935)*16+0.5)/16,\"N/A\"))","v":"N/A"}]
[{"$f":"IF(ModelNo=B218,10,\"\")","v":""},"9023","Screen Height",{"$f":"Frame_Height-5.1875","v":-5.1875}]
[{"$f":"IF(ModelNo=B219,11,\"\")","v":""},"9023","Egress Opening Width",{"$f":"(Frame_Width/4)-3.25","v":-3.25}]
[{"$f":"IF(ModelNo=B220,12,\"\")","v":""},"9023","Egress Opening Height",{"$f":"Frame_Height-6.125","v":-6.125}]
[{"$f":"IF(ModelNo=B221,13,\"\")","v":""},"9023","Egress Opening Area (sq.ft.)",{"$f":"(D219*D220)/144","v":0.13823784722222221}]
[{"$f":"IF(ModelNo=B222,1,\"\")","v":""},"9029","Operating Sash Width",{"$f":"TRUNC(((Frame_Width/3)-0.4163)*32+0.5)/32","v":-0.375}]
[{"$f":"IF(ModelNo=B223,2,\"\")","v":""},"9029","Operating Sash Height",{"$f":"Frame_Height-3.9375","v":-3.9375}]
[{"$f":"IF(ModelNo=B224,3,\"\")","v":""},"9029","Fixed Sash Width",{"$f":"TRUNC(((Frame_Width/3)-1.4163)*32+0.5)/32","v":-1.375}]
[{"$f":"IF(ModelNo=B225,4,\"\")","v":""},"9029","Fixed Sash Height",{"$f":"Frame_Height-4.9375","v":-4.9375}]
[{"$f":"IF(ModelNo=B226,5,\"\")","v":""},"9029","Operating Sash Glass Width",{"$f":"TRUNC((D222-2.875)*32+0.5)/32","v":-3.21875}]
[{"$f":"IF(ModelNo=B227,6,\"\")","v":""},"9029","Operating Sash Glass Height",{"$f":"TRUNC((D223-2.8125)*32+0.5)/32","v":-6.71875}]
[{"$f":"IF(ModelNo=B228,7,\"\")","v":""},"9029","Fixed Sash Glass Width",{"$f":"TRUNC((D224-1.875)*32+0.5)/32","v":-3.21875}]
[{"$f":"IF(ModelNo=B229,8,\"\")","v":""},"9029","Fixed Sash Glass Height",{"$f":"TRUNC((D225-1.8125)*32+0.5)/32","v":-6.71875}]
[{"$f":"IF(ModelNo=B230,9,\"\")","v":""},"9029","Screen Width",{"$f":"IF(Screen=\"Full\",INT((Frame_Width-5.59375)*16+0.5)/16,IF(Screen=\"Half\",INT(((Frame_Width/3)-1.4165)*16+0.5)/16,\"N/A\"))","v":"N/A"}]
[{"$f":"IF(ModelNo=B231,10,\"\")","v":""},"9029","Screen Height",{"$f":"Frame_Height-5.1875","v":-5.1875}]
[{"$f":"IF(ModelNo=B232,11,\"\")","v":""},"9029","Egress Opening Width",{"$f":"(Frame_Width/3)-4","v":-4}]
[{"$f":"IF(ModelNo=B233,12,\"\")","v":""},"9029","Egress Opening Height",{"$f":"Frame_Height-6.125","v":-6.125}]
[{"$f":"IF(ModelNo=B234,13,\"\")","v":""},"9029","Egress Opening Area (sq.ft.)",{"$f":"(D232*D233)/144","v":0.1701388888888889}]
[{"$f":"IF(OR(ModelNo=\"9102\",ModelNo=\"9105\",ModelNo=\"9106\",ModelNo=\"9108\",ModelNo=\"9175\"),1,\"\")","v":""},"9102","Sash Width",{"$f":"(Frame_Width/2)-0.1875","v":-0.1875}]
[{"$f":"IF(OR(ModelNo=\"9102\",ModelNo=\"9105\",ModelNo=\"9106\",ModelNo=\"9108\",ModelNo=\"9175\"),2,\"\")","v":""},"9102","Sash Height",{"$f":"Frame_Height-3.6875","v":-3.6875}]
[{"$f":"IF(OR(ModelNo=\"9102\",ModelNo=\"9105\",ModelNo=\"9106\",ModelNo=\"9108\",ModelNo=\"9175\"),3,\"\")","v":""},"9102","Operating Sash Roller Track Length",{"$f":"Frame_Width-2.5","v":-2.5}]
[{"$f":"IF(OR(ModelNo=\"9102\",ModelNo=\"9105\",ModelNo=\"9106\",ModelNo=\"9108\",ModelNo=\"9175\"),4,\"\")","v":""},"9102","Screen Roller Track Length",{"$f":"Frame_Width","v":0}]
[{"$f":"IF(OR(ModelNo=\"9102\",ModelNo=\"9105\",ModelNo=\"9106\",ModelNo=\"9108\",ModelNo=\"9175\"),5,\"\")","v":""},"9102","Fixed Panel Support",{"$f":"(Frame_Width/2)-0.25","v":-0.25}]
[{"$f":"IF(OR(ModelNo=\"9102\",ModelNo=\"9105\",ModelNo=\"9106\",ModelNo=\"9108\",ModelNo=\"9175\"),6,\"\")","v":""},"9102","Glass Width",{"$f":"(Frame_Width/2)-3.75","v":-3.75}]
[{"$f":"IF(OR(ModelNo=\"9102\",ModelNo=\"9105\",ModelNo=\"9106\",ModelNo=\"9108\",ModelNo=\"9175\"),7,\"\")","v":""},"9102","Glass Height",{"$f":"Frame_Height-8.9375","v":-8.9375}]
[{"$f":"IF(OR(ModelNo=\"9102\",ModelNo=\"9105\",ModelNo=\"9106\",ModelNo=\"9108\",ModelNo=\"9175\"),8,\"\")","v":""},"9102","Screen Width",{"$f":"(Frame_Width/2)-0.9375","v":-0.9375}]
[{"$f":"IF(OR(ModelNo=\"9102\",ModelNo=\"9105\",ModelNo=\"9106\",ModelNo=\"9108\",ModelNo=\"9175\"),9,\"\")","v":""},"9102","Screen Height",{"$f":"Frame_Height-3.125","v":-3.125}]
[{"$f":"IF(OR(ModelNo=\"9102\",ModelNo=\"9105\",ModelNo=\"9106\",ModelNo=\"9108\",ModelNo=\"9175\"),10,\"\")","v":""},"9102","Egress Opening Width",{"$f":"(Frame_Width/2)-6.4375","v":-6.4375}]
[{"$f":"IF(OR(ModelNo=\"9102\",ModelNo=\"9105\",ModelNo=\"9106\",ModelNo=\"9108\",ModelNo=\"9175\"),11,\"\")","v":""},"9102","Egress Opening Height",{"$f":"Frame_Height-4.875","v":-4.875}]
[{"$f":"IF(OR(ModelNo=\"9102\",ModelNo=\"9105\",ModelNo=\"9106\",ModelNo=\"9108\",ModelNo=\"9175\"),12,\"\")","v":""},"9102","Egress Opening Area (sq.ft.)",{"$f":"(D244*D245)/144","v":0.21793619791666666}]
[{"$f":"IF(OR(ModelNo=\"9103\",ModelNo=\"9109\",ModelNo=\"9122\"),1,\"\")","v":""},"9103","Sash Width",{"$f":"(TRUNC(((Frame_Width/3)-0.4792)*16+0.5)/16)+0.4375","v":0}]
[{"$f":"IF(OR(ModelNo=\"9103\",ModelNo=\"9109\",ModelNo=\"9122\"),2,\"\")","v":""},"9103","Sash Height",{"$f":"Frame_Height-3.6875","v":-3.6875}]
[{"$f":"IF(OR(ModelNo=\"9103\",ModelNo=\"9109\",ModelNo=\"9122\"),3,\"\")","v":""},"9103","Operating Sash Roller Track Length",{"$f":"Frame_Width-2.5","v":-2.5}]
[{"$f":"IF(OR(ModelNo=\"9103\",ModelNo=\"9109\",ModelNo=\"9122\"),4,\"\")","v":""},"9103","Screen Roller Track Length",{"$f":"Frame_Width","v":0}]
[{"$f":"IF(OR(ModelNo=\"9103\",ModelNo=\"9109\",ModelNo=\"9122\"),5,\"\")","v":""},"9103","Fixed Panel Support",{"$f":"TRUNC(((Frame_Width/3)-0.10412)*16+0.5)/16","v":-6.25E-2}]
[{"$f":"IF(OR(ModelNo=\"9103\",ModelNo=\"9109\",ModelNo=\"9122\"),6,\"\")","v":""},"9103","Glass Width",{"$f":"TRUNC(((Frame_Width/3)-3.60412)*16+0.5)/16","v":-3.5625}]
[{"$f":"IF(OR(ModelNo=\"9103\",ModelNo=\"9109\",ModelNo=\"9122\"),7,\"\")","v":""},"9103","Glass Height",{"$f":"Frame_Height-8.9375","v":-8.9375}]
[{"$f":"IF(OR(ModelNo=\"9103\",ModelNo=\"9109\",ModelNo=\"9122\"),8,\"\")","v":""},"9103","Screen Width",{"$f":"TRUNC(((Frame_Width/3)-0.7917)*16+0.5)/16","v":-0.75}]
[{"$f":"IF(OR(ModelNo=\"9103\",ModelNo=\"9109\",ModelNo=\"9122\"),9,\"\")","v":""},"9103","Screen Height",{"$f":"Frame_Height-3.125","v":-3.125}]
[{"$f":"IF(OR(ModelNo=\"9103\",ModelNo=\"9109\",ModelNo=\"9122\"),10,\"\")","v":""},"9103","Egress Opening Width",{"$f":"TRUNC(((Frame_Width/3)-6.16666667)*16+0.5)/16","v":-6.125}]
[{"$f":"IF(OR(ModelNo=\"9103\",ModelNo=\"9109\",ModelNo=\"9122\"),11,\"\")","v":""},"9103","Egress Opening Height",{"$f":"Frame_Height-4.875","v":-4.875}]
[{"$f":"IF(OR(ModelNo=\"9103\",ModelNo=\"9109\",ModelNo=\"9122\"),12,\"\")","v":""},"9103","Egress Opening Area (sq.ft.)",{"$f":"(D256*D257)/144","v":0.20735677083333334}]
[{"$f":"IF(OR(ModelNo=\"9104\",ModelNo=\"9112\"),1,\"\")","v":""},"9104","Sash Width",{"$f":"(TRUNC(((Frame_Width/4)-0.1875)*16+0.5)/16)+0.4375","v":0.3125}]
[{"$f":"IF(OR(ModelNo=\"9104\",ModelNo=\"9112\"),2,\"\")","v":""},"9104","Sash Height",{"$f":"Frame_Height-3.6875","v":-3.6875}]
[{"$f":"IF(OR(ModelNo=\"9104\",ModelNo=\"9112\"),3,\"\")","v":""},"9104","Operating Sash Roller Track Length",{"$f":"Frame_Width-2.5","v":-2.5}]
[{"$f":"IF(OR(ModelNo=\"9104\",ModelNo=\"9112\"),4,\"\")","v":""},"9104","Screen Roller Track Length",{"$f":"Frame_Width","v":0}]
[{"$f":"IF(OR(ModelNo=\"9104\",ModelNo=\"9112\"),5,\"\")","v":""},"9104","Fixed Panel Support",{"$f":"TRUNC(((Frame_Width/4)+0.1875)*16+0.5)/16","v":0.1875}]
[{"$f":"IF(OR(ModelNo=\"9104\",ModelNo=\"9112\"),6,\"\")","v":""},"9104","Four Panel Mullion",{"$f":"Frame_Height-3.6875","v":-3.6875}]
[{"$f":"IF(OR(ModelNo=\"9104\",ModelNo=\"9112\"),7,\"\")","v":""},"9104","Screw Cover Snap on Mullion",{"$f":"Frame_Height-6","v":-6}]
[{"$f":"IF(OR(ModelNo=\"9104\",ModelNo=\"9112\"),8,\"\")","v":""},"9104","Glass Width",{"$f":"TRUNC(((Frame_Width/4)-3.3125)*16+0.5)/16","v":-3.25}]
[{"$f":"IF(OR(ModelNo=\"9104\",ModelNo=\"9112\"),9,\"\")","v":""},"9104","Glass Height",{"$f":"Frame_Height-8.9375","v":-8.9375}]
[{"$f":"IF(OR(ModelNo=\"9104\",ModelNo=\"9112\"),10,\"\")","v":""},"9104","Screen Width",{"$f":"TRUNC((Frame_Width/4)*16+0.5)/16","v":0}]
[{"$f":"IF(OR(ModelNo=\"9104\",ModelNo=\"9112\"),11,\"\")","v":""},"9104","Screen Height",{"$f":"Frame_Height-3.125","v":-3.125}]
[{"$f":"IF(OR(ModelNo=\"9104\",ModelNo=\"9112\"),12,\"\")","v":""},"9104","Egress Opening Width",{"$f":"TRUNC(((Frame_Width/4)+6)*16+0.5)/16","v":6}]
[{"$f":"IF(OR(ModelNo=\"9104\",ModelNo=\"9112\"),13,\"\")","v":""},"9104","Egress Opening Height",{"$f":"Frame_Height-4.875","v":-4.875}]
[{"$f":"IF(OR(ModelNo=\"9104\",ModelNo=\"9112\"),14,\"\")","v":""},"9104","Egress Opening Area (sq.ft.)",{"$f":"(D270*D271)/144","v":-0.203125}]
[{"$f":"IF(OR(ModelNo=\"9202\",ModelNo=\"9205\",ModelNo=\"9206\",ModelNo=\"9208\",ModelNo=\"9275\"),1,\"\")","v":""},9202,"Sash Width",{"$f":"(Frame_Width/2)-0.0625","v":-6.25E-2}]
[{"$f":"IF(OR(ModelNo=\"9202\",ModelNo=\"9205\",ModelNo=\"9206\",ModelNo=\"9208\",ModelNo=\"9275\"),2,\"\")","v":""},9202,"Sash Height",{"$f":"Frame_Height-3.25","v":-3.25}]
[{"$f":"IF(OR(ModelNo=\"9202\",ModelNo=\"9205\",ModelNo=\"9206\",ModelNo=\"9208\",ModelNo=\"9275\"),3,\"\")","v":""},9202,"Operating Sash Roller Track Length",{"$f":"Frame_Width-1.875","v":-1.875}]
[{"$f":"IF(OR(ModelNo=\"9202\",ModelNo=\"9205\",ModelNo=\"9206\",ModelNo=\"9208\",ModelNo=\"9275\"),4,\"\")","v":""},9202,"Screen Roller Track Length",{"$f":"Frame_Width-1.8125","v":-1.8125}]
[{"$f":"IF(OR(ModelNo=\"9202\",ModelNo=\"9205\",ModelNo=\"9206\",ModelNo=\"9208\",ModelNo=\"9275\"),5,\"\")","v":""},9202,"Fixed Panel Support",{"$f":"(Frame_Width/2)-0.1875","v":-0.1875}]
[{"$f":"IF(OR(ModelNo=\"9202\",ModelNo=\"9205\",ModelNo=\"9206\",ModelNo=\"9208\",ModelNo=\"9275\"),6,\"\")","v":""},9202,"Glass Width",{"$f":"(Frame_Width/2)-3.6875","v":-3.6875}]
[{"$f":"IF(OR(ModelNo=\"9202\",ModelNo=\"9205\",ModelNo=\"9206\",ModelNo=\"9208\",ModelNo=\"9275\"),7,\"\")","v":""},9202,"Glass Height",{"$f":"Frame_Height-6.875","v":-6.875}]
[{"$f":"IF(OR(ModelNo=\"9202\",ModelNo=\"9205\",ModelNo=\"9206\",ModelNo=\"9208\",ModelNo=\"9275\"),8,\"\")","v":""},9202,"Screen Width",{"$f":"(Frame_Width/2)-1.5","v":-1.5}]
[{"$f":"IF(OR(ModelNo=\"9202\",ModelNo=\"9205\",ModelNo=\"9206\",ModelNo=\"9208\",ModelNo=\"9275\"),9,\"\")","v":""},9202,"Screen Height",{"$f":"Frame_Height-2.75","v":-2.75}]
[{"$f":"IF(OR(ModelNo=\"9202\",ModelNo=\"9205\",ModelNo=\"9206\",ModelNo=\"9208\",ModelNo=\"9275\"),10,\"\")","v":""},9202,"Egress Opening Width",{"$f":"Frame_Width-D273-((2.108*2)+2.5)","v":-6.6535000000000002}]
[{"$f":"IF(OR(ModelNo=\"9202\",ModelNo=\"9205\",ModelNo=\"9206\",ModelNo=\"9208\",ModelNo=\"9275\"),11,\"\")","v":""},9202,"Egress Opening Height",{"$f":"Frame_Height-(2.108*2)","v":-4.2160000000000002}]
[{"$f":"IF(OR(ModelNo=\"9202\",ModelNo=\"9205\",ModelNo=\"9206\",ModelNo=\"9208\",ModelNo=\"9275\"),12,\"\")","v":""},9202,"Egress Opening Area (sq.ft.)",{"$f":"(D282*D283)/144","v":0.19479969444444445}]
[{"$f":"IF(OR(ModelNo=\"9203\",ModelNo=\"9209\",ModelNo=\"9222\"),1,\"\")","v":""},9203,"Sash Width",{"$f":"TRUNC(((Frame_Width+0.375)/3)*16+0.5)/16","v":0.125}]
[{"$f":"IF(OR(ModelNo=\"9203\",ModelNo=\"9209\",ModelNo=\"9222\"),2,\"\")","v":""},9203,"Sash Height",{"$f":"Frame_Height-3.25","v":-3.25}]
[{"$f":"IF(OR(ModelNo=\"9203\",ModelNo=\"9209\",ModelNo=\"9222\"),3,\"\")","v":""},9203,"Operating Sash Roller Track Length",{"$f":"TRUNC((((2*Frame_Width)-4.3125)/3)*16+0.5)/16","v":-1.375}]
[{"$f":"IF(OR(ModelNo=\"9203\",ModelNo=\"9209\",ModelNo=\"9222\"),4,\"\")","v":""},9203,"Screen Roller Track Length",{"$f":"TRUNC(((Frame_Width-0.75)/3)*16+0.5)/16","v":-0.1875}]
[{"$f":"IF(OR(ModelNo=\"9203\",ModelNo=\"9209\",ModelNo=\"9222\"),5,\"\")","v":""},9203,"Fixed Panel Support",{"$f":"TRUNC((Frame_Width/3)*16+0.5)/16","v":0}]
[{"$f":"IF(OR(ModelNo=\"9203\",ModelNo=\"9209\",ModelNo=\"9222\"),6,\"\")","v":""},9203,"Glass Width",{"$f":"TRUNC(((Frame_Width/3)-3.5)*16+0.5)/16","v":-3.4375}]
[{"$f":"IF(OR(ModelNo=\"9203\",ModelNo=\"9209\",ModelNo=\"9222\"),7,\"\")","v":""},9203,"Glass Height",{"$f":"Frame_Height-6.875","v":-6.875}]
[{"$f":"IF(OR(ModelNo=\"9203\",ModelNo=\"9209\",ModelNo=\"9222\"),8,\"\")","v":""},9203,"Screen Width",{"$f":"TRUNC(((Frame_Width-3.9375)/3)*16+0.5)/16","v":-1.25}]
[{"$f":"IF(OR(ModelNo=\"9203\",ModelNo=\"9209\",ModelNo=\"9222\"),9,\"\")","v":""},9203,"Screen Height",{"$f":"Frame_Height-2.75","v":-2.75}]
[{"$f":"IF(OR(ModelNo=\"9203\",ModelNo=\"9209\",ModelNo=\"9222\"),10,\"\")","v":""},9203,"Egress Opening Width",{"$f":"Frame_Width-(2.108*2)-(D285*2)-2.5-0.5","v":-7.4660000000000002}]
[{"$f":"IF(OR(ModelNo=\"9203\",ModelNo=\"9209\",ModelNo=\"9222\"),11,\"\")","v":""},9203,"Egress Opening Height",{"$f":"Frame_Height-(2.108*2)","v":-4.2160000000000002}]
[{"$f":"IF(OR(ModelNo=\"9203\",ModelNo=\"9209\",ModelNo=\"9222\"),12,\"\")","v":""},9203,"Egress Opening Area (sq.ft.)",{"$f":"(D294*D295)/144","v":0.21858788888888891}]
[{"$f":"IF(OR(ModelNo=\"9204\",ModelNo=\"9212\"),1,\"\")","v":""},9204,"Sash Width",{"$f":"(TRUNC(((Frame_Width+1.375)/4)*16+0.5)/16)+0.4375","v":0.8125}]
[{"$f":"IF(OR(ModelNo=\"9204\",ModelNo=\"9212\"),2,\"\")","v":""},9204,"Sash Height",{"$f":"Frame_Height-3.25","v":-3.25}]
[{"$f":"IF(OR(ModelNo=\"9204\",ModelNo=\"9212\"),3,\"\")","v":""},9204,"Operating Sash Roller Track Length",{"$f":"Frame_Width-1.875","v":-1.875}]
[{"$f":"IF(OR(ModelNo=\"9204\",ModelNo=\"9212\"),4,\"\")","v":""},9204,"Screen Roller Track Length",{"$f":"Frame_Width-1.8125","v":-1.8125}]
[{"$f":"IF(OR(ModelNo=\"9204\",ModelNo=\"9212\"),5,\"\")","v":""},9204,"Fixed Panel Support",{"$f":"TRUNC(((Frame_Width+0.875)/4)*16+0.5)/16","v":0.25}]
[{"$f":"IF(OR(ModelNo=\"9204\",ModelNo=\"9212\"),6,\"\")","v":""},9204,"Glass Width",{"$f":"TRUNC(((Frame_Width/4)-3.281)*16+0.5)/16","v":-3.1875}]
[{"$f":"IF(OR(ModelNo=\"9204\",ModelNo=\"9212\"),7,\"\")","v":""},9204,"Glass Height",{"$f":"Frame_Height-6.875","v":-6.875}]
[{"$f":"IF(OR(ModelNo=\"9204\",ModelNo=\"9212\"),8,\"\")","v":""},9204,"Screen Width",{"$f":"TRUNC(((Frame_Width/4)-1.125)*16+0.5)/16","v":-1.0625}]
[{"$f":"IF(OR(ModelNo=\"9204\",ModelNo=\"9212\"),9,\"\")","v":""},9204,"Screen Height",{"$f":"Frame_Height-2.75","v":-2.75}]
[{"$f":"IF(OR(ModelNo=\"9204\",ModelNo=\"9212\"),10,\"\")","v":""},9204,"Egress Opening Width",{"$f":"Frame_Width-(D297*2)-(2.108*2)-(2.5*2)-0.875","v":-11.716000000000001}]
[{"$f":"IF(OR(ModelNo=\"9204\",ModelNo=\"9212\"),11,\"\")","v":""},9204,"Egress Opening Height",{"$f":"Frame_Height-(2.108*2)","v":-4.2160000000000002}]
[{"$f":"IF(OR(ModelNo=\"9204\",ModelNo=\"9212\"),12,\"\")","v":""},9204,"Egress Opening Area (sq.ft.)",{"$f":"(D306*D307)/144","v":0.34301844444444446}]
[{"$f":"IF(OR(ModelNo=\"9402\",ModelNo=\"9405\",ModelNo=\"9406\",ModelNo=\"9408\",ModelNo=\"9475\"),1,\"\")","v":""},"9402","Sash Width",{"$f":"IF(TYPE=2,TRUNC(((Frame_Width/2)+1)*16+0.5)/16,TRUNC(((Frame_Width/2)+0.1875)*16+0.5)/16)","v":0.1875}]
[{"$f":"IF(OR(ModelNo=\"9402\",ModelNo=\"9405\",ModelNo=\"9406\",ModelNo=\"9408\",ModelNo=\"9475\"),2,\"\")","v":""},"9402","Sash Height",{"$f":"Frame_Height-3.375","v":-3.375}]
[{"$f":"IF(OR(ModelNo=\"9402\",ModelNo=\"9405\",ModelNo=\"9406\",ModelNo=\"9408\",ModelNo=\"9475\"),3,\"\")","v":""},"9402","Operating Sash Roller Track Length",{"$f":"IF(TYPE=3,Frame_Width-8.1875,Frame_Width-4.0625)","v":-4.0625}]
[{"$f":"IF(OR(ModelNo=\"9402\",ModelNo=\"9405\",ModelNo=\"9406\",ModelNo=\"9408\",ModelNo=\"9475\"),4,\"\")","v":""},"9402","Screen Roller Track Length (Sill)",{"$f":"IF(TYPE=3,Frame_Width-2.25,\"N/A\")","v":"N/A"}]
[{"$f":"IF(OR(ModelNo=\"9402\",ModelNo=\"9405\",ModelNo=\"9406\",ModelNo=\"9408\",ModelNo=\"9475\"),5,\"\")","v":""},"9402","Screen Roller Track Length (Head)",{"$f":"Frame_Width-3.0625","v":-3.0625}]
[{"$f":"IF(OR(ModelNo=\"9402\",ModelNo=\"9405\",ModelNo=\"9406\",ModelNo=\"9408\",ModelNo=\"9475\"),6,\"\")","v":""},"9402","Fixed Panel Support",{"$f":"IF(TYPE=1,TRUNC(((Frame_Width/2)-0.8125)*16+0.5)/16,IF(TYPE=2,TRUNC(((Frame_Width/2))*32+0.5)/32,IF(TYPE=3,TRUNC(((Frame_Width/2)-10)*32+0.5)/32,\"\")))","v":-0.75}]
[{"$f":"IF(OR(ModelNo=\"9402\",ModelNo=\"9405\",ModelNo=\"9406\",ModelNo=\"9408\",ModelNo=\"9475\"),7,\"\")","v":""},"9402","Glass Width",{"$f":"IF(TYPE=2,TRUNC(((Frame_Width/2)-7.875)*16+0.5)/16,TRUNC(((Frame_Width/2)-5.1875)*16+0.5)/16)","v":-5.125}]
[{"$f":"IF(OR(ModelNo=\"9402\",ModelNo=\"9405\",ModelNo=\"9406\",ModelNo=\"9408\",ModelNo=\"9475\"),8,\"\")","v":""},"9402","Glass Height",{"$f":"IF(TYPE=1,TRUNC((Frame_Height-8.6875)*16+0.5)/16,IF(TYPE=2,TRUNC((Frame_Height-12.1875)*32+0.5)/32,IF(TYPE=3,TRUNC((Frame_Height-14.1875)*32+0.5)/32,\"\")))","v":-8.625}]
[{"$f":"IF(OR(ModelNo=\"9402\",ModelNo=\"9405\",ModelNo=\"9406\",ModelNo=\"9408\",ModelNo=\"9475\"),9,\"\")","v":""},"9402","Screen Width",{"$f":"(Frame_Width/2)-0.125","v":-0.125}]
[{"$f":"IF(OR(ModelNo=\"9402\",ModelNo=\"9405\",ModelNo=\"9406\",ModelNo=\"9408\",ModelNo=\"9475\"),10,\"\")","v":""},"9402","Screen Height",{"$f":"IF(TYPE=3,Frame_Height-2.9375,Frame_Height-2.5625)","v":-2.5625}]
[{"$f":"IF(OR(ModelNo=\"9402\",ModelNo=\"9405\",ModelNo=\"9406\",ModelNo=\"9408\",ModelNo=\"9475\"),11,\"\")","v":""},"9402","Egress Opening Width",{"$f":"TRUNC((Frame_Width-D309-(2.176*2)-4)*16+0.5)/16","v":-8.5}]
[{"$f":"IF(OR(ModelNo=\"9402\",ModelNo=\"9405\",ModelNo=\"9406\",ModelNo=\"9408\",ModelNo=\"9475\"),12,\"\")","v":""},"9402","Egress Opening Height",{"$f":"Frame_Height-(2.25*2)","v":-4.5}]
[{"$f":"IF(OR(ModelNo=\"9402\",ModelNo=\"9405\",ModelNo=\"9406\",ModelNo=\"9408\",ModelNo=\"9475\"),13,\"\")","v":""},"9402","Egress Opening Area (sq.ft.)",{"$f":"(D320*D319)/144","v":0.265625}]
[{"$f":"IF(OR(ModelNo=\"9403\",ModelNo=\"9409\",ModelNo=\"9422\"),1,\"\")","v":""},"9403","Sash Width",{"$f":"IF(TYPE=2,TRUNC(((Frame_Width/3)+0.958)*16+0.5)/16,TRUNC(((Frame_Width/3)+0.333)*16+0.5)/16)","v":0.3125}]
[{"$f":"IF(OR(ModelNo=\"9403\",ModelNo=\"9409\",ModelNo=\"9422\"),2,\"\")","v":""},"9403","Sash Height",{"$f":"Frame_Height-3.375","v":-3.375}]
[{"$f":"IF(OR(ModelNo=\"9403\",ModelNo=\"9409\",ModelNo=\"9422\"),3,\"\")","v":""},"9403","Operating Sash Roller Track Length",{"$f":"IF(TYPE=3,Frame_Width-12.375,Frame_Width-4.0625)","v":-4.0625}]
[{"$f":"IF(OR(ModelNo=\"9403\",ModelNo=\"9409\",ModelNo=\"9422\"),4,\"\")","v":""},"9403","Screen Roller Track Length (Sill)",{"$f":"IF(TYPE=3,Frame_Width-2.25,\"N/A\")","v":"N/A"}]
[{"$f":"IF(OR(ModelNo=\"9403\",ModelNo=\"9409\",ModelNo=\"9422\"),5,\"\")","v":""},"9403","Screen Roller Track Length (Head)",{"$f":"Frame_Width-3.0625","v":-3.0625}]
[{"$f":"IF(OR(ModelNo=\"9403\",ModelNo=\"9409\",ModelNo=\"9422\"),6,\"\")","v":""},"9403","Fixed Panel Support",{"$f":"IF(TYPE=1,TRUNC(((Frame_Width/3)-0.541)*16+0.5)/16,IF(TYPE=2,TRUNC(((Frame_Width/3)+0.042)*32+0.5)/32,IF(TYPE=3,TRUNC(((Frame_Width/3)-9.854)*32+0.5)/32,\"\")))","v":-0.5}]
[{"$f":"IF(OR(ModelNo=\"9403\",ModelNo=\"9409\",ModelNo=\"9422\"),7,\"\")","v":""},"9403","Glass Width",{"$f":"IF(TYPE=2,TRUNC(((Frame_Width/3)-7.917)*16+0.5)/16,TRUNC(((Frame_Width/3)-5.042)*16+0.5)/16)","v":-5}]
[{"$f":"IF(OR(ModelNo=\"9403\",ModelNo=\"9409\",ModelNo=\"9422\"),8,\"\")","v":""},"9403","Glass Height",{"$f":"IF(TYPE=1,TRUNC((Frame_Height-8.6875)*16+0.5)/16,IF(TYPE=2,TRUNC((Frame_Height-12.1875)*32+0.5)/32,IF(TYPE=3,TRUNC((Frame_Height-14.1875)*32+0.5)/32,\"\")))","v":-8.625}]
[{"$f":"IF(OR(ModelNo=\"9403\",ModelNo=\"9409\",ModelNo=\"9422\"),9,\"\")","v":""},"9403","Screen Width",{"$f":"TRUNC(((Frame_Width/3)+0.021)*16+0.5)/16","v":0}]
[{"$f":"IF(OR(ModelNo=\"9403\",ModelNo=\"9409\",ModelNo=\"9422\"),10,\"\")","v":""},"9403","Screen Height",{"$f":"IF(TYPE=3,Frame_Height-2.9375,Frame_Height-2.5625)","v":-2.5625}]
[{"$f":"IF(OR(ModelNo=\"9403\",ModelNo=\"9409\",ModelNo=\"9422\"),11,\"\")","v":""},"9403","Egress Opening Width",{"$f":"(TRUNC((Frame_Width-(D322*2)-(2.176*2)-4)*16+0.5)/16)+0.875","v":-8.0625}]
[{"$f":"IF(OR(ModelNo=\"9403\",ModelNo=\"9409\",ModelNo=\"9422\"),12,\"\")","v":""},"9403","Egress Opening Height",{"$f":"Frame_Height-(2.25*2)","v":-4.5}]
[{"$f":"IF(OR(ModelNo=\"9403\",ModelNo=\"9409\",ModelNo=\"9422\"),13,\"\")","v":""},"9403","Egress Opening Area (sq.ft.)",{"$f":"(D333*D332)/144","v":0.251953125}]
[{"$f":"IF(OR(ModelNo=\"9404\",ModelNo=\"9412\"),1,\"\")","v":""},"9404","Sash Width",{"$f":"IF(TYPE=2,TRUNC(((Frame_Width/4)+1.4375)*16+0.5)/16,TRUNC(((Frame_Width/4)+0.625)*16+0.5)/16)","v":0.625}]
[{"$f":"IF(OR(ModelNo=\"9404\",ModelNo=\"9412\"),2,\"\")","v":""},"9404","Sash Height",{"$f":"Frame_Height-3.375","v":-3.375}]
[{"$f":"IF(OR(ModelNo=\"9404\",ModelNo=\"9412\"),3,\"\")","v":""},"9404","Operating Sash Roller Track Length",{"$f":"IF(TYPE=3,Frame_Width-12.375,Frame_Width-4.0625)","v":-4.0625}]
[{"$f":"IF(OR(ModelNo=\"9404\",ModelNo=\"9412\"),4,\"\")","v":""},"9404","Screen Roller Track Length (Sill)",{"$f":"IF(TYPE=3,Frame_Width-2.25,\"N/A\")","v":"N/A"}]
[{"$f":"IF(OR(ModelNo=\"9404\",ModelNo=\"9412\"),5,\"\")","v":""},"9404","Screen Roller Track Length (Head)",{"$f":"Frame_Width-3.0625","v":-3.0625}]
[{"$f":"IF(OR(ModelNo=\"9404\",ModelNo=\"9412\"),6,\"\")","v":""},"9404","Fixed Panel Support",{"$f":"IF(TYPE=1,TRUNC(((Frame_Width/4)-0.375)*16+0.5)/16,IF(TYPE=2,TRUNC(((Frame_Width/4)+0.437)*32+0.5)/32,IF(TYPE=3,TRUNC(((Frame_Width/4)-9.5625)*32+0.5)/32,\"\")))","v":-0.3125}]
[{"$f":"IF(OR(ModelNo=\"9404\",ModelNo=\"9412\"),7,\"\")","v":""},"9404","Glass Width",{"$f":"IF(TYPE=2,TRUNC(((Frame_Width/4)-7.4375)*16+0.5)/16,TRUNC(((Frame_Width/4)-4.75)*16+0.5)/16)","v":-4.6875}]
[{"$f":"IF(OR(ModelNo=\"9404\",ModelNo=\"9412\"),8,\"\")","v":""},"9404","Glass Height",{"$f":"IF(TYPE=1,TRUNC((Frame_Height-8.6875)*16+0.5)/16,IF(TYPE=2,TRUNC((Frame_Height-12.1875)*32+0.5)/32,IF(TYPE=3,TRUNC((Frame_Height-14.1875)*32+0.5)/32,\"\")))","v":-8.625}]
[{"$f":"IF(OR(ModelNo=\"9404\",ModelNo=\"9412\"),9,\"\")","v":""},"9404","Screen Width",{"$f":"TRUNC(((Frame_Width/4)+0.3125)*16+0.5)/16","v":0.3125}]
[{"$f":"IF(OR(ModelNo=\"9404\",ModelNo=\"9412\"),10,\"\")","v":""},"9404","Screen Height",{"$f":"IF(TYPE=3,Frame_Height-2.9375,Frame_Height-2.5625)","v":-2.5625}]
[{"$f":"IF(OR(ModelNo=\"9404\",ModelNo=\"9412\"),11,\"\")","v":""},"9404","Egress Opening Width",{"$f":"TRUNC(((Frame_Width-(D335+4.375)*2)-2.1875)*16+0.5)/16","v":-12.125}]
[{"$f":"IF(OR(ModelNo=\"9404\",ModelNo=\"9412\"),12,\"\")","v":""},"9404","Egress Opening Height",{"$f":"Frame_Height-(2.25*2)","v":-4.5}]
[{"$f":"IF(OR(ModelNo=\"9404\",ModelNo=\"9412\"),13,\"\")","v":""},"9404","Egress Opening Area (sq.ft.)",{"$f":"(D346*D345)/144","v":0.37890625}]
[{"$f":"IF(ModelNo=B348,1,0)","v":0},"3001","Top Sash Width",{"$f":"Frame_Width-4.125","v":-4.125}]
[{"$f":"IF(ModelNo=B349,2,0)","v":0},"3001","Top Sash Height",{"$f":"DDIM3001-1.625","v":-1.625}]
[{"$f":"IF(ModelNo=B350,3,0)","v":0},"3001","Bottom Sash Width",{"$f":"Frame_Width-3.125","v":-3.125}]
[{"$f":"IF(ModelNo=B351,4,0)","v":0},"3001","Bottom Sash Height",{"$f":"CDIM3001-0.625","v":-0.625}]
[{"$f":"IF(ModelNo=B352,5,0)","v":0},"3001","Top Glass Width",{"$f":"TGW_3001","v":-5.75}]
[{"$f":"IF(ModelNo=B353,6,0)","v":0},"3001","Top Glass Height",{"$f":"TGH_3001","v":-3.21875}]
[{"$f":"IF(ModelNo=B354,7,0)","v":0},"3001","Bottom Glass Width",{"$f":"BGW_3001","v":-4.75}]
[{"$f":"IF(ModelNo=B355,8,0)","v":0},"3001","Bottom Glass Height",{"$f":"BGH_3001","v":-2.21875}]
[{"$f":"IF(ModelNo=B356,9,0)","v":0},"3001","Screen Width",{"$f":"IF(Screen=\"Half\",Frame_Width-4.5,Frame_Width-4.5625)","v":-4.5625}]
[{"$f":"IF(ModelNo=B357,10,0)","v":0},"3001","Screen Height",{"$f":"IF(Screen=\"L\",TRUNC((CDIM3001-0.75)*16+0.5)/16,IF(Screen=\"F\",TRUNC((Frame_Height-3.3125)*16+0.5)/16,TRUNC((CDIM3001-0.75)*16+0.5)/16))","v":-0.6875}]
[{"$f":"IF(ModelNo=B358,11,0)","v":0},"3001","Top Sash Weight (Plus 5 lb)",{"$f":"TOP_WGT&\" \"&\"lb\"","v":{"$error":"#N/A"}}]
[{"$f":"IF(ModelNo=B359,12,0)","v":0},"3001","Top Balance Size (Block & Tackle)",{"$f":"IF(TOP_TUBE=0,\"N/A\",TOP_TUBE)","v":{"$error":"#N/A"}}]
[{"$f":"IF(ModelNo=B360,13,0)","v":0},"3001","Bottom Sash Weight",{"$f":"BTM_WGT&\" \"&\"lb\"","v":{"$error":"#N/A"}}]
[{"$f":"IF(ModelNo=B361,14,0)","v":0},"3001","Bottom Balance Size (Block & Tackle)",{"$f":"IF(BTM_TUBE=0,\"N/A\",BTM_TUBE)","v":{"$error":"#N/A"}}]
[{"$f":"IF(ModelNo=B362,15,0)","v":0},"3001","Egress Opening Width",{"$f":"EW","v":{"$error":"#N/A"}}]
[{"$f":"IF(ModelNo=B363,16,0)","v":0},"3001","Egress Opening Height",{"$f":"EH","v":{"$error":"#N/A"}}]
[{"$f":"IF(ModelNo=B364,17,0)","v":0},"3001","Egress Opening Area (sq.ft.)",{"$f":"EO","v":{"$error":"#N/A"}}]
[{"$f":"IF(ModelNo=B365,1,0)","v":0},"3002","Sash Width",{"$f":"(Frame_Width/2)-0.875","v":-0.875}]
[{"$f":"IF(ModelNo=B366,2,0)","v":0},"3002","Sash Height",{"$f":"Frame_Height-3.8125","v":-3.8125}]
[{"$f":"IF(ModelNo=B367,3,0)","v":0},"3002","Roller Track Length",{"$f":"Frame_Width-2.6875","v":-2.6875}]
[{"$f":"IF(ModelNo=B368,4,0)","v":0},"3002","Glass Width",{"$f":"(Frame_Width/2)-2.5625","v":-2.5625}]
[{"$f":"IF(ModelNo=B369,5,0)","v":0},"3002","Glass Height",{"$f":"Frame_Height-5.4375","v":-5.4375}]
[{"$f":"IF(ModelNo=B370,6,0)","v":0},"3002","Screen Width",{"$f":"IF(Screen=\"F\",Frame_Width-5,IF(Screen=\"L\",\"N/A\",(Frame_Width/2)-2.4375))","v":-2.4375}]
[{"$f":"IF(ModelNo=B371,7,0)","v":0},"3002","Screen Height",{"$f":"Frame_Height-4.5625","v":-4.5625}]
[{"$f":"IF(ModelNo=B372,8,0)","v":0},"3002","Egress Opening Width",{"$f":"(Frame_Width/2)-4.75","v":-4.75}]
[{"$f":"IF(ModelNo=B373,9,0)","v":0},"3002","Egress Opening Height",{"$f":"Frame_Height-5.25","v":-5.25}]
[{"$f":"IF(ModelNo=B374,10,0)","v":0},"3002","Egress Opening Area (sq.ft.)",{"$f":"(D372*D373)/144","v":0.17317708333333334}]
[{"$f":"IF(ModelNo=B375,1,0)","v":0},"3003","Operating Sash Width",{"$f":"(TRUNC((Frame_Width/4+1.125)*16+0.5)/16)-0.9375","v":0.1875}]
[{"$f":"IF(ModelNo=B376,2,0)","v":0},"3003","Operating Sash Height",{"$f":"Frame_Height-3.8125","v":-3.8125}]
[{"$f":"IF(ModelNo=B377,3,0)","v":0},"3003","Fixed Sash Width",{"$f":"Frame_Width-2*(TRUNC((Frame_Width/4+1.125)*16+0.5)/16)+1","v":-1.25}]
[{"$f":"IF(ModelNo=B378,4,0)","v":0},"3003","Fixed Sash Height",{"$f":"Frame_Height-3.8125","v":-3.8125}]
[{"$f":"IF(ModelNo=B379,5,0)","v":0},"3003","Roller Track Length",{"$f":"Frame_Width-2.6875","v":-2.6875}]
[{"$f":"IF(ModelNo=B380,6,0)","v":0},"3003","Operating Sash Glass Width",{"$f":"D375-1.6875","v":-1.5}]
[{"$f":"IF(ModelNo=B381,7,0)","v":0},"3003","Operating Sash Glass Height",{"$f":"Frame_Height-5.4375","v":-5.4375}]
[{"$f":"IF(ModelNo=B382,8,0)","v":0},"3003","Fixed Sash Glass Width",{"$f":"D377-1.6875","v":-2.9375}]
[{"$f":"IF(ModelNo=B383,9,0)","v":0},"3003","Fixed Sash Glass Height",{"$f":"Frame_Height-5.4375","v":-5.4375}]
[{"$f":"IF(ModelNo=B384,10,0)","v":0},"3003","Screen Width",{"$f":"IF(Screen=\"F\",Frame_Width-5,IF(Screen=\"L\",\"N/A\",TRUNC(((Frame_Width/4)-1.25)*16+0.5)/16))","v":-1.1875}]
[{"$f":"IF(ModelNo=B385,11,0)","v":0},"3003","Screen Height",{"$f":"Frame_Height-4.5625","v":-4.5625}]
[{"$f":"IF(ModelNo=B386,12,0)","v":0},"3003","Egress Opening Width",{"$f":"(Frame_Width/4)-2.25","v":-2.25}]
[{"$f":"IF(ModelNo=B387,13,0)","v":0},"3003","Egress Opening Height",{"$f":"Frame_Height-5.25","v":-5.25}]
[{"$f":"IF(ModelNo=B388,14,0)","v":0},"3003","Egress Opening Area (sq.ft.)",{"$f":"(D386*D387)/144","v":8.203125E-2}]
[{"$f":"IF(ModelNo=B389,1,0)","v":0},"3004","Glass Width",{"$f":"Frame_Width-4.1875","v":-4.1875}]
[{"$f":"IF(ModelNo=B390,2,0)","v":0},"3004","Glass Height",{"$f":"Frame_Height-4.1875","v":-4.1875}]
[{"$f":"IF(ModelNo=B391,3,0)","v":0},"3004","Glass Area (sq.ft.)",{"$f":"(D389*D390)/144","v":0.12177191840277778}]
[{"$f":"IF(ModelNo=B392,1,0)","v":0},"3009","Operating Sash Width",{"$f":"TRUNC(((Frame_Width/3)-0.3125)*16+0.5)/16","v":-0.25}]
[{"$f":"IF(ModelNo=B393,2,0)","v":0},"3009","Operating Sash Height",{"$f":"Frame_Height-3.8125","v":-3.8125}]
[{"$f":"IF(ModelNo=B394,3,0)","v":0},"3009","Fixed Sash Width",{"$f":"TRUNC(((Frame_Width/3)-0.25)*16+0.5)/16","v":-0.1875}]
[{"$f":"IF(ModelNo=B395,4,0)","v":0},"3009","Fixed Sash Height",{"$f":"Frame_Height-3.8125","v":-3.8125}]
[{"$f":"IF(ModelNo=B396,5,0)","v":0},"3009","Roller Track Length",{"$f":"Frame_Width-2.6875","v":-2.6875}]
[{"$f":"IF(ModelNo=B397,6,0)","v":0},"3009","Operating Sash Glass Width",{"$f":"D392-1.6875","v":-1.9375}]
[{"$f":"IF(ModelNo=B398,7,0)","v":0},"3009","Operating Sash Glass Height",{"$f":"Frame_Height-5.4375","v":-5.4375}]
[{"$f":"IF(ModelNo=B399,8,0)","v":0},"3009","Fixed Sash Glass Width",{"$f":"D394-1.6875","v":-1.875}]
[{"$f":"IF(ModelNo=B400,9,0)","v":0},"3009","Fixed Sash Glass Height",{"$f":"Frame_Height-5.4375","v":-5.4375}]
[{"$f":"IF(ModelNo=B401,10,0)","v":0},"3009","Screen Width",{"$f":"IF(Screen=\"F\",Frame_Width-5,IF(Screen=\"L\",\"N/A\",TRUNC((Frame_Width/3+0.625)*16+0.5)/16-2.375))","v":-1.75}]
[{"$f":"IF(ModelNo=B402,11,0)","v":0},"3009","Screen Height",{"$f":"Frame_Height-4.5625","v":-4.5625}]
[{"$f":"IF(ModelNo=B403,12,0)","v":0},"3009","Egress Opening Width",{"$f":"(Frame_Width/3)-4.375","v":-4.375}]
[{"$f":"IF(ModelNo=B404,13,0)","v":0},"3009","Egress Opening Height",{"$f":"Frame_Height-5.25","v":-5.25}]
[{"$f":"IF(ModelNo=B405,14,0)","v":0},"3009","Egress Opening Area (sq.ft.)",{"$f":"(D403*D404)/144","v":0.15950520833333334}]